{"text_format":"1","workbook":"xlsx","n_sheets":31,"sheets":["Cover","Signature Page","Preface","Change Record","1. Introduction","Instructions","Project Data","Capacitors","Resistors","General Purpose Diodes","VVZBF Diodes","Varactor Diode","Microcircuit - Hermetic","Microcircuits - PEM","Connectors","Magnetics","Crystal Oscillator","Junction Transistors","MOSFET Transistors","Filters","Solid Body Fuses","Hollow Body Fuses","Heaters","Thermistors","Crystal","Relays","Switches","Wire & Cable","Hybrid Microcircuit","Revision notes","Sheet1"],"not_rendered":{"charts":0,"images":3,"macros":1,"external_links":3,"defined_names":45,"comments":1,"pivot_tables":0},"unopened":[],"bounds":{"document_bytes":16777216,"sheet_cells":100000,"rows_first":2000,"rows_last":500,"rows_between":2000,"halvings":0,"cell_chars":16384,"cell_head_chars":4096},"cells_cut":0,"cells_raw":0,"read":"whole","date_system":"1900"}

{"sheet":"Cover","index":0,"n_rows":11,"n_cols":3,"rows_kept":11,"cut":false,"hidden":false,"merged":[[39,0,39,9],[38,0,38,9],[4,2,7,8],[10,2,14,8]]}
[]
[]
[]
[]
[null,null,"<Document Number> [16 pt, TNR, non-bold], Revision [-,A]\n<Project / Code>"]
[]
[]
[]
[]
[]
[null,null,"<Document Title> [24 pt bold>"]

{"sheet":"Signature Page","index":1,"n_rows":19,"n_cols":1,"rows_kept":19,"cut":false,"hidden":false,"merged":[[2,0,3,2]]}
[]
[]
["<Enter full document title here>\nSignature/Approval Page"]
[]
[]
[]
["Prepared by:"]
[]
["<Enter originator's name here>"]
[]
["Reviewers/Approvers:"]
[]
["<CM will list the names of all reviewers and approvers at the time of release>"]
[]
[]
[]
["Approved by:"]
[]
["<CM will enter PDL's name here>"]

{"sheet":"Preface","index":2,"n_rows":3,"n_cols":5,"rows_kept":3,"cut":false,"hidden":false,"merged":[]}
[]
[]
[null,null,null,null,"Preface"]

{"sheet":"Change Record","index":3,"n_rows":6,"n_cols":3,"rows_kept":6,"cut":false,"hidden":false,"merged":[[1,0,1,2],[3,0,4,0],[3,2,4,2],[3,1,4,1]]}
[]
["Change History Log"]
[]
["Revision","Effective Date","Description of Changes\n(Reference the CCR & CCB/ERB Approval Date)"]
[]
["Revision -",null,"Released per <Project>-CCR/SCoRe-XXXX"]

{"sheet":"1. Introduction","index":4,"n_rows":37,"n_cols":4,"rows_kept":37,"cut":false,"hidden":false,"merged":[[29,1,29,2],[29,3,29,8],[0,0,0,2],[2,1,8,8],[10,1,16,8],[17,1,17,3],[18,1,19,8],[20,1,20,4],[21,1,26,8],[27,1,27,2],[27,3,27,8],[28,1,28,2],[28,3,28,8],[30,1,30,2],[30,3,30,8],[31,1,31,3],[32,1,35,8],[36,1,36,2],[36,3,36,8],[40,1,40,8],[41,1,41,2],[41,3,41,8],[37,1,37,2],[37,3,37,8],[38,1,38,2],[38,3,38,8],[39,1,39,2],[39,3,39,8]]}
["1. INTRODUCTION"]
[1.1000000000000001,"Purpose"]
[null,"This document provides a detailed parts stress analysis for the  <Project Name>  <CARD>"]
[]
[]
[]
[]
[]
[]
[1.2,"Scope"]
[null,"The parts stress analysis (PSA) was performed on <Project Name>  <CARD>. The analysis is required to show compliance to parts requirement of EEE-INST-002."]
[]
[]
[]
[]
[]
[]
[1.3,"Related Documentation"]
[null,"The latest versions of all documents below should be used.  <Project Name>  documents can be  obtained  from URL: https://ipdtdms.gsfc.nasa.gov"]
[]
["1.3.1","Applicable Documents"]
[null,"The following documents are referenced within this document and are directly applicable or contain policies or other directive matters that are binding for the contents of this document.  In the event of conflict between an Applicable Document and the content of this document, the applicable Signature Authority has the final authority for conflict resolution."]
[]
[]
[]
[]
[]
[null,"Document Number",null,"Title"]
[]
[]
[]
["1.3.2","Reference Documents"]
[null,"The following documents are referenced herein and amplify or clarify the information presented in this document.  These documents are not binding on the content of this document."]
[]
[]
[]
[null,"Document Number",null,"Title"]

{"sheet":"Instructions","index":5,"n_rows":69,"n_cols":1,"rows_kept":69,"cut":false,"hidden":false,"merged":[]}
["Parts Derating Workbook  (Prepared as an aid in complying with the GSFC derating requirements specified in EEE-INST-002)"]
["Revision 4.5  9/28/2021 - See Revision Notes sheet for changes"]
["The individual worksheets cover the parts derating requirements for each type of component listed in EEE-INST-002 GSFC Document:  EEE-INST-002 - Instructions for EEE Parts Derating issued May 2003"]
[]
[]
["If EEE-INST-002 is updated the user of this spreadsheet needs to update the parameters to the latest version before using."]
["Check for latest version at URL:"]
["http://gdms.gsfc.nasa.gov"]
["Checked and verified that there are no updates to EEE-INST-002 as of: 02/28/2023"]
["NOTE: a Major Revision of EEE-INST-002 is currently in process and will soon be released.  This workbook will be updated as required to meet the changes."]
["For further information or questions about the use of this workbook contact GSFC Code 371 Reliability paula.s.pruessner@nasa.gov or charlie.knapp@nasa.gov"]
[]
[]
["Color Key"]
["To be completed by Design Engineer"]
["To be completed by Reliability Engineer  (Some of these columns have been automated or provide drop down lists showing the allowable entries)"]
["To be completed by Mechanical/Thermal Engineer"]
["To be completed prior to CDR if not available for PDR"]
[]
["When cutting and pasting data into this sheet use PASTE SPECIAL and VALUES to avoid pasting in formatting features such as locked cells which will prevent later changes"]
[]
["Please note that all entries are in basic units of Volts, Amps, Watts, Ohms, temperature is in degrees C,  and frequency is in Hertz"]
[]
["The derating factors contained herein do not preclude further more stringent derating; for example, to account for radiation induced degradation. Developer controlled derating plans may be used upon acceptable review and project approval."]
[]
["It is suggested for your convenience that when you are using a particular spreadsheet rightclick on the tab to change the tab color to quickly find the sheets you are using."]
[]
[]
[]
[]
[]
[]
[]
[]
[]
[]
[]
[]
[]
[]
[]
[]
[]
[]
[]
[]
[]
[]
[]
[]
[]
[]
[]
[]
[]
[]
[]
[]
[]
[]
[]
[]
[]
[]
[]
[]
[]
[]
["jjkkgg"]

{"sheet":"Project Data","index":6,"n_rows":13,"n_cols":2,"rows_kept":13,"cut":false,"hidden":false,"merged":[]}
["Enter Project identification information on this sheet."]
[]
[]
[]
[null,"Project"]
[null,"Component / Board"]
[null,"Product Design Lead"]
[null,"Analyst"]
[null,"Date Performed"]
[null,"Parts List Version and Date"]
[null,"Schematic Version and Date"]
[null,"Box Thermal Conditions (Nominal Voltages, Temps, etc.)"]
[null,"Description of Card and Usage (Location, function)"]

{"sheet":"Capacitors","index":7,"n_rows":836,"n_cols":25,"rows_kept":836,"cut":false,"hidden":false,"merged":[[12,9,12,10]]}
["Capacitor Derating Worksheet (reference GSFC Document EEE-INST-002, Section C1, Table 4)",null,null,null,null,null,null,null,"CUI//SP-EXPT"]
[null,null,null,null,null,null,null,"         Project Revised criteria for use as flag note 4/, Table 4, Section C1, of EEE-INST-002 (Addendum 1):",null,null,null,null,null,null,"Cap Type"]
["Notes:",null,null,null,null,null,null,"         4/ The effective series resistance of an unregulated power supply line/circuit shall be ≥ 0.1 ohms per volt",null,null,null,null,null,null,"C","  Ceramic - (Types CCR, CKS, CKR, CDR)",null,null,null,null,null,null,null,"Derating Rate","Max Temp"]
["     1) Derating factor applies to the sum of peak AC ripple and DC polarizing voltage.",null,null,null,null,null,null,"              or 1 ohm, whichever is greater, for Grade 2 applications, and ≥ 0.3 ohms per volt or 1 ohm whichever",null,null,null,null,null,null,"WS","  Tantalum, Wet Slug - (Types CLR79, CLR81)"]
["     2) For low-voltage applications (<10 VDC), parts shall be rated ≥100 VDC for styles CCR, CKR, CDR. ",null,null,null,null,null,null,"              is greater, for Grade 1 applications, if a solid tantalum capacitor is used in a filtering application.",null,null,null,null,null,null,"SD","  Tantalum, Solid - (Types CSR, CSS, CWR)",null,null,null,null,null,null,null,0.6,110]
["         Special test is required for parts with =< 100VDC rating.",null,null,null,null,null,null,"         a/ The effective series resistance of the power supply line/circuit that the capacitor \"sees\" ",null,null,null,null,null,null,"TF","  Tantalum, Foil - (Types CLR25, CLR27, CLR3R3)",null,{"$f":"IF((#REF!<>\"WS\")*OR(#REF!<>\"SD\"),#REF!,IF(#REF!>70,#REF!,#REF!))","v":{"$error":"#REF!"}},null,null,null,null,null,0.5,85]
["     3) For Tantalum Wet Slug, derate voltage linearly from 70°C to 110°C.",null,null,null,null,null,null,"             does not include addition of the equivalent series resistance (ESR) of the capacitor.",null,null,null,null,null,null,"PF","  Plastic Film - (Types CRH, CHS)",null,null,null,null,null,null,null," ",70]
["     4) For Tantalum Solid (CSR, CSS & CWR), the effective series resistance shall be at least 0.1 ohms ",null,null,null,null,null,null,"         b/ A power supply line/circuit is considered to be unregulated if the turn-on ",null,null,null,null,null,null,"G","  Glass - (Types CYR) "]
["         per volt or 1 ohm, whichever is greater, for Grade 2 applications, and at least 0.3 ohms per volt or   ",null,null,null,null,null,null,"             or turn-off surge can exceed 1A, the during a period of less than 250uS.",null,null,null,null,null,null,null,null,null,{"$f":"#REF!/#REF!","v":{"$error":"#REF!"}},null,null,null,null,null,"App Grade"]
["        1 ohm, whichever is greater, for Grade 1 applications.",null,null,null,null,null,null,"         c/ If the power supply line/circuit is shown to be regulated (e.g. does not meet the definition of unregulated",null,null,null,null,null,null,null,null,null,null,null,null,null,null,null,"Grade 1 (0.3/V, /1) ","  Tantalum, Solid - Grade 1 applications"]
["     5) For tantalum Solid with a requlated power supply, the effective series resistance does not need to be applied (per memo 562-PM-2012-02) ",null,null,null,null,null,null,"             in 4b), the effective series resistance calculation, and subsequent implementation, is not applicable.",null,null,null,null,null,null,"Fails derating ",null,null,{"$f":"IF(ISBLANK(#REF!),\"y\",\"n\")","v":"n"},null,null,null,null,null,"Grade 2 (0.1/V, /1)","  Tantalum, Solid - Grade 2 applications"]
[null,null,null,null,null,null,null,null,null,null,null,null,null,null,"  requirement",null,null,null,null,null,null,null,null,"Not Applicable","  Tantalum, Solid - Regulated Power Supply"]
[null,"COMPONENT SPECIFICATION SECTION",null,null,null,null,null,null,null,"DERATING SECTION"]
["Component","Ref. Des.","Maximum Operating Voltage, Rated","Voltage Derating Factor","Capacitor Type","Thermally Adjusted Voltage Derating","GSFC Derated Voltage Rqmt","Actual Operating Voltage","GSFC Derated Temperature Rqmt","Actual Operating Temperature","Solid Tantalum ESR in Ω (See Note 4)","Solid Tantalum ESR Applications (See Note 4)","Pass/Fail","REMARKS"]
[null,null,null,{"$f":"IF(E15=\"\", \"\", IF(E15=\"C\",0.6,IF(E15=\"SD\",0.5,IF(E15=\"WS\",0.6,IF(E15=\"TF\",0.5,IF(E15=\"PF\",0.6,0.5))))))","v":""},null,{"$f":"IF(ISBLANK(E15),D15,IF(J15>110,IF(E15=\"WS\",0.4,IF(E15=\"SD\",0.3)),(IF(J15>70,(IF(E15=\"WS\",0.6-(1-(110-J15)/(110-70))*(0.6-0.4),IF(E15=\"SD\",0.5-(1-(110-J15)/(110-70))*(0.5-0.3),D15))),D15))))","v":""},{"$f":"IF((C15<>\"\")*AND(F15<>\"\"), C15*F15, \"\")","v":""},null,{"$f":"IF(E15=\"\", \"\", IF(E15=\"SD\",110,IF(E15=\"WS\",110,IF(E15=\"C\",110,IF(E15=\"TF\",70,IF(E15=\"PF\",85,110))))))","v":""},null,null,null,{"$f":"IF((H15<>\"\")*AND(J15<>\"\")*AND(C15<>\"\")*AND(E15<>\"\"), IF((H15<=G15)*AND(J15<=I15)*AND(P15+Q15+R15>1),\"PASS\",\"FAIL\"), \"INC\")","v":"INC"},{"$f":"IF((E15=\"C\")*AND(C15<>\"\")*AND(C15<100)*AND(H15<10),\"See Note 2) above in cell A5 & A6\",IF((E15=\"SD\")*AND(L15=\"Not Applicable\"),\"Regulated Power Supply Assumed\",\"\"))","v":""},{"$f":"IF(E15=\"WS\",0.6-(1-(110-J15)/(110-70))*(0.6-0.4),IF(E15=\"SD\",0.5-(1-(110-J15)/(110-70))*(0.5-0.3),D15))","v":""},{"$f":"IF((E15=\"SD\")*AND(K15>=1),1,IF(L15=$X$12,1,0))","v":0},{"$f":"IF(E15=\"SD\", IF((L15=$X$10)*AND(K15/H15>=0.3), 1, IF((L15=$X$11)*AND(K15/H15>=0.1), 1, IF(L15=$X$12, 1, 0))), 1)","v":1},{"$f":"IF(E15<>\"SD\",1,0)","v":1},{"$f":"IF(E15=\"SD\", IF(L15=$X$10, 0.3*H15, IF(L15=$X$11, 0.1*H15, (K15-1))), K15-1)","v":-1},{"$f":"IF(E15=\"SD\", IF(K15>=1, IF(K15>=S15, 0, 1), 1), 0)","v":0}]
[null,null,null,"",null,"","",null,"",null,null,null,"INC","","",0,1,1,-1,0]
[null,null,null,"",null,"","",null,"",null,null,null,"INC","","",0,1,1,-1,0]
[null,null,null,"",null,"","",null,"",null,null,null,"INC","","",0,1,1,-1,0]
[null,null,null,"",null,"","",null,"",null,null,null,"INC","","",0,1,1,-1,0]
[null,null,null,"",null,"","",null,"",null,null,null,"INC","","",0,1,1,-1,0]
[null,null,null,"",null,"","",null,"",null,null,null,"INC","","",0,1,1,-1,0]
[null,null,null,"",null,"","",null,"",null,null,null,"INC","","",0,1,1,-1,0]
[null,null,null,"",null,"","",null,"",null,null,null,"INC","","",0,1,1,-1,0]
[null,null,null,"",null,"","",null,"",null,null,null,"INC","","",0,1,1,-1,0]
[null,null,null,"",null,"","",null,"",null,null,null,"INC","","",0,1,1,-1,0]
[null,null,null,"",null,"","",null,"",null,null,null,"INC","","",0,1,1,-1,0]
[null,null,null,"",null,"","",null,"",null,null,null,"INC","","",0,1,1,-1,0]
[null,null,null,"",null,"","",null,"",null,null,null,"INC","","",0,1,1,-1,0]
[null,null,null,"",null,"","",null,"",null,null,null,"INC","","",0,1,1,-1,0]
[null,null,null,"",null,"","",null,"",null,null,null,"INC",{"$f":"IF((E30=\"C\")*AND(C30<>\"\")*AND(C30<100)*AND(H30<10),\"See Note 2) above in cell A5 & A6\",IF((E30=\"SD\")*AND(L30=\"Not Applicable\"),\"Regulated Power Supply Assumed\",\"\"))","v":""},"",0,1,1,-1,0]
[null,null,null,"",null,"","",null,"",null,null,null,"INC","","",0,1,1,-1,0]
[null,null,null,"",null,"","",null,"",null,null,null,"INC","","",0,1,1,-1,0]
[null,null,null,"",null,"","",null,"",null,null,null,"INC","","",0,1,1,-1,0]
[null,null,null,"",null,"","",null,"",null,null,null,"INC","","",0,1,1,-1,0]
[null,null,null,"",null,"","",null,"",null,null,null,"INC","","",0,1,1,-1,0]
[null,null,null,"",null,"","",null,"",null,null,null,"INC","","",0,1,1,-1,0]
[null,null,null,"",null,"","",null,"",null,null,null,"INC","","",0,1,1,-1,0]
[null,null,null,"",null,"","",null,"",null,null,null,"INC","","",0,1,1,-1,0]
[null,null,null,"",null,"","",null,"",null,null,null,"INC","","",0,1,1,-1,0]
[null,null,null,"",null,"","",null,"",null,null,null,"INC","","",0,1,1,-1,0]
[null,null,null,"",null,"","",null,"",null,null,null,"INC","","",0,1,1,-1,0]
[null,null,null,"",null,"","",null,"",null,null,null,"INC","","",0,1,1,-1,0]
[null,null,null,"",null,"","",null,"",null,null,null,"INC","","",0,1,1,-1,0]
[null,null,null,"",null,"","",null,"",null,null,null,"INC","","",0,1,1,-1,0]
[null,null,null,"",null,"","",null,"",null,null,null,"INC","","",0,1,1,-1,0]
[null,null,null,"",null,"","",null,"",null,null,null,"INC","","",0,1,1,-1,0]
[null,null,null,"",null,"","",null,"",null,null,null,"INC","","",0,1,1,-1,0]
[null,null,null,"",null,"","",null,"",null,null,null,"INC","","",0,1,1,-1,0]
[null,null,null,"",null,"","",null,"",null,null,null,"INC","","",0,1,1,-1,0]
[null,null,null,"",null,"","",null,"",null,null,null,"INC","","",0,1,1,-1,0]
[null,null,null,"",null,"","",null,"",null,null,null,"INC","","",0,1,1,-1,0]
[null,null,null,"",null,"","",null,"",null,null,null,"INC","","",0,1,1,-1,0]
[null,null,null,"",null,"","",null,"",null,null,null,"INC","","",0,1,1,-1,0]
[null,null,null,"",null,"","",null,"",null,null,null,"INC","","",0,1,1,-1,0]
[null,null,null,"",null,"","",null,"",null,null,null,"INC","","",0,1,1,-1,0]
[null,null,null,"",null,"","",null,"",null,null,null,"INC","","",0,1,1,-1,0]
[null,null,null,"",null,"","",null,"",null,null,null,"INC","","",0,1,1,-1,0]
[null,null,null,"",null,"","",null,"",null,null,null,"INC","","",0,1,1,-1,0]
[null,null,null,"",null,"","",null,"",null,null,null,"INC","","",0,1,1,-1,0]
[null,null,null,"",null,"","",null,"",null,null,null,"INC","","",0,1,1,-1,0]
[null,null,null,"",null,"","",null,"",null,null,null,"INC","","",0,1,1,-1,0]
[null,null,null,"",null,"","",null,"",null,null,null,"INC","","",0,1,1,-1,0]
[null,null,null,"",null,"","",null,"",null,null,null,"INC","","",0,1,1,-1,0]
[null,null,null,"",null,"","",null,"",null,null,null,"INC","","",0,1,1,-1,0]
[null,null,null,"",null,"","",null,"",null,null,null,"INC","","",0,1,1,-1,0]
[null,null,null,"",null,"","",null,"",null,null,null,"INC","","",0,1,1,-1,0]
[null,null,null,"",null,"","",null,"",null,null,null,"INC","","",0,1,1,-1,0]
[null,null,null,"",null,"","",null,"",null,null,null,"INC","","",0,1,1,-1,0]
[null,null,null,"",null,"","",null,"",null,null,null,"INC","","",0,1,1,-1,0]
[null,null,null,"",null,"","",null,"",null,null,null,"INC","","",0,1,1,-1,0]
[null,null,null,"",null,"","",null,"",null,null,null,"INC","","",0,1,1,-1,0]
[null,null,null,"",null,"","",null,"",null,null,null,"INC","","",0,1,1,-1,0]
[null,null,null,"",null,"","",null,"",null,null,null,"INC","","",0,1,1,-1,0]
[null,null,null,"",null,"","",null,"",null,null,null,"INC","","",0,1,1,-1,0]
[null,null,null,"",null,"","",null,"",null,null,null,"INC","","",0,1,1,-1,0]
[null,null,null,"",null,"","",null,"",null,null,null,"INC","","",0,1,1,-1,0]
[null,null,null,"",null,{"$f":"IF(ISBLANK(E77),D77,IF(J77>110,IF(E77=\"WS\",0.4,IF(E77=\"SD\",0.3)),(IF(J77>70,(IF(E77=\"WS\",0.6-(1-(110-J77)/(110-70))*(0.6-0.4),IF(E77=\"SD\",0.5-(1-(110-J77)/(110-70))*(0.5-0.3),D77))),D77))))","v":""},"",null,"",null,null,null,"INC","","",0,1,1,-1,0]
[null,null,null,"",null,{"$f":"IF(ISBLANK(E78),D78,IF(J78>110,IF(E78=\"WS\",0.4,IF(E78=\"SD\",0.3)),(IF(J78>70,(IF(E78=\"WS\",0.6-(1-(110-J78)/(110-70))*(0.6-0.4),IF(E78=\"SD\",0.5-(1-(110-J78)/(110-70))*(0.5-0.3),D78))),D78))))","v":""},"",null,"",null,null,null,"INC","","",0,1,1,-1,0]
[null,null,null,{"$f":"IF(E79=\"\", \"\", IF(E79=\"C\",0.6,IF(E79=\"SD\",0.5,IF(E79=\"WS\",0.6,IF(E79=\"TF\",0.5,IF(E79=\"PF\",0.6,0.5))))))","v":""},null,"",{"$f":"IF((C79<>\"\")*AND(F79<>\"\"), C79*F79, \"\")","v":""},null,{"$f":"IF(E79=\"\", \"\", IF(E79=\"SD\",110,IF(E79=\"WS\",110,IF(E79=\"C\",110,IF(E79=\"TF\",70,IF(E79=\"PF\",85,110))))))","v":""},null,null,null,{"$f":"IF((H79<>\"\")*AND(J79<>\"\")*AND(C79<>\"\")*AND(E79<>\"\"), IF((H79<=G79)*AND(J79<=I79)*AND(P79+Q79+R79>1),\"PASS\",\"FAIL\"), \"INC\")","v":"INC"},{"$f":"IF((E79=\"C\")*AND(C79<>\"\")*AND(C79<100)*AND(H79<10),\"See Note 2) above in cell A5 & A6\",IF((E79=\"SD\")*AND(L79=\"Not Applicable\"),\"Regulated Power Supply Assumed\",\"\"))","v":""},{"$f":"IF(E79=\"WS\",0.6-(1-(110-J79)/(110-70))*(0.6-0.4),IF(E79=\"SD\",0.5-(1-(110-J79)/(110-70))*(0.5-0.3),D79))","v":""},{"$f":"IF((E79=\"SD\")*AND(K79>=1),1,IF(L79=$X$12,1,0))","v":0},{"$f":"IF(E79=\"SD\", IF((L79=$X$10)*AND(K79/H79>=0.3), 1, IF((L79=$X$11)*AND(K79/H79>=0.1), 1, IF(L79=$X$12, 1, 0))), 1)","v":1},{"$f":"IF(E79<>\"SD\",1,0)","v":1},{"$f":"IF(E79=\"SD\", IF(L79=$X$10, 0.3*H79, IF(L79=$X$11, 0.1*H79, (K79-1))), K79-1)","v":-1},{"$f":"IF(E79=\"SD\", IF(K79>=1, IF(K79>=S79, 0, 1), 1), 0)","v":0}]
[null,null,null,"",null,"","",null,"",null,null,null,"INC","","",0,1,1,-1,0]
[null,null,null,"",null,"","",null,"",null,null,null,"INC","","",0,1,1,-1,0]
[null,null,null,"",null,"","",null,"",null,null,null,"INC","","",0,1,1,-1,0]
[null,null,null,"",null,"","",null,"",null,null,null,"INC","","",0,1,1,-1,0]
[null,null,null,"",null,"","",null,"",null,null,null,"INC","","",0,1,1,-1,0]
[null,null,null,"",null,"","",null,"",null,null,null,"INC","","",0,1,1,-1,0]
[null,null,null,"",null,"","",null,"",null,null,null,"INC","","",0,1,1,-1,0]
[null,null,null,"",null,"","",null,"",null,null,null,"INC","","",0,1,1,-1,0]
[null,null,null,"",null,"","",null,"",null,null,null,"INC","","",0,1,1,-1,0]
[null,null,null,"",null,"","",null,"",null,null,null,"INC","","",0,1,1,-1,0]
[null,null,null,"",null,"","",null,"",null,null,null,"INC","","",0,1,1,-1,0]
[null,null,null,"",null,"","",null,"",null,null,null,"INC","","",0,1,1,-1,0]
[null,null,null,"",null,"","",null,"",null,null,null,"INC","","",0,1,1,-1,0]
[null,null,null,"",null,"","",null,"",null,null,null,"INC","","",0,1,1,-1,0]
[null,null,null,"",null,"","",null,"",null,null,null,"INC","","",0,1,1,-1,0]
[null,null,null,"",null,"","",null,"",null,null,null,"INC","","",0,1,1,-1,0]
[null,null,null,"",null,"","",null,"",null,null,null,"INC","","",0,1,1,-1,0]
[null,null,null,"",null,"","",null,"",null,null,null,"INC","","",0,1,1,-1,0]
[null,null,null,"",null,"","",null,"",null,null,null,"INC","","",0,1,1,-1,0]
[null,null,null,"",null,"","",null,"",null,null,null,"INC","","",0,1,1,-1,0]
[null,null,null,"",null,"","",null,"",null,null,null,"INC","","",0,1,1,-1,0]
[null,null,null,"",null,"","",null,"",null,null,null,"INC","","",0,1,1,-1,0]
[null,null,null,"",null,"","",null,"",null,null,null,"INC","","",0,1,1,-1,0]
[null,null,null,"",null,"","",null,"",null,null,null,"INC","","",0,1,1,-1,0]
[null,null,null,"",null,"","",null,"",null,null,null,"INC","","",0,1,1,-1,0]
[null,null,null,"",null,"","",null,"",null,null,null,"INC","","",0,1,1,-1,0]
[null,null,null,"",null,"","",null,"",null,null,null,"INC","","",0,1,1,-1,0]
[null,null,null,"",null,"","",null,"",null,null,null,"INC","","",0,1,1,-1,0]
[null,null,null,"",null,"","",null,"",null,null,null,"INC","","",0,1,1,-1,0]
[null,null,null,"",null,"","",null,"",null,null,null,"INC","","",0,1,1,-1,0]
[null,null,null,"",null,"","",null,"",null,null,null,"INC","","",0,1,1,-1,0]
[null,null,null,"",null,"","",null,"",null,null,null,"INC","","",0,1,1,-1,0]
[null,null,null,"",null,"","",null,"",null,null,null,"INC","","",0,1,1,-1,0]
[null,null,null,"",null,"","",null,"",null,null,null,"INC","","",0,1,1,-1,0]
[null,null,null,"",null,"","",null,"",null,null,null,"INC","","",0,1,1,-1,0]
[null,null,null,"",null,"","",null,"",null,null,null,"INC","","",0,1,1,-1,0]
[null,null,null,"",null,"","",null,"",null,null,null,"INC","","",0,1,1,-1,0]
[null,null,null,"",null,"","",null,"",null,null,null,"INC","","",0,1,1,-1,0]
[null,null,null,"",null,"","",null,"",null,null,null,"INC","","",0,1,1,-1,0]
[null,null,null,"",null,"","",null,"",null,null,null,"INC","","",0,1,1,-1,0]
[null,null,null,"",null,"","",null,"",null,null,null,"INC","","",0,1,1,-1,0]
[null,null,null,"",null,"","",null,"",null,null,null,"INC","","",0,1,1,-1,0]
[null,null,null,"",null,"","",null,"",null,null,null,"INC","","",0,1,1,-1,0]
[null,null,null,"",null,"","",null,"",null,null,null,"INC","","",0,1,1,-1,0]
[null,null,null,"",null,"","",null,"",null,null,null,"INC","","",0,1,1,-1,0]
[null,null,null,"",null,"","",null,"",null,null,null,"INC","","",0,1,1,-1,0]
[null,null,null,"",null,"","",null,"",null,null,null,"INC","","",0,1,1,-1,0]
[null,null,null,"",null,"","",null,"",null,null,null,"INC","","",0,1,1,-1,0]
[null,null,null,"",null,"","",null,"",null,null,null,"INC","","",0,1,1,-1,0]
[null,null,null,"",null,"","",null,"",null,null,null,"INC","","",0,1,1,-1,0]
[null,null,null,"",null,"","",null,"",null,null,null,"INC","","",0,1,1,-1,0]
[null,null,null,"",null,"","",null,"",null,null,null,"INC","","",0,1,1,-1,0]
[null,null,null,"",null,"","",null,"",null,null,null,"INC","","",0,1,1,-1,0]
[null,null,null,"",null,"","",null,"",null,null,null,"INC","","",0,1,1,-1,0]
[null,null,null,"",null,"","",null,"",null,null,null,"INC","","",0,1,1,-1,0]
[null,null,null,"",null,"","",null,"",null,null,null,"INC","","",0,1,1,-1,0]
[null,null,null,"",null,"","",null,"",null,null,null,"INC","","",0,1,1,-1,0]
[null,null,null,"",null,"","",null,"",null,null,null,"INC","","",0,1,1,-1,0]
[null,null,null,"",null,"","",null,"",null,null,null,"INC","","",0,1,1,-1,0]
[null,null,null,"",null,"","",null,"",null,null,null,"INC","","",0,1,1,-1,0]
[null,null,null,"",null,"","",null,"",null,null,null,"INC","","",0,1,1,-1,0]
[null,null,null,"",null,"","",null,"",null,null,null,"INC","","",0,1,1,-1,0]
[null,null,null,"",null,{"$f":"IF(ISBLANK(E142),D142,IF(J142>110,IF(E142=\"WS\",0.4,IF(E142=\"SD\",0.3)),(IF(J142>70,(IF(E142=\"WS\",0.6-(1-(110-J142)/(110-70))*(0.6-0.4),IF(E142=\"SD\",0.5-(1-(110-J142)/(110-70))*(0.5-0.3),D142))),D142))))","v":""},"",null,"",null,null,null,"INC","","",0,1,1,-1,0]
[null,null,null,{"$f":"IF(E143=\"\", \"\", IF(E143=\"C\",0.6,IF(E143=\"SD\",0.5,IF(E143=\"WS\",0.6,IF(E143=\"TF\",0.5,IF(E143=\"PF\",0.6,0.5))))))","v":""},null,"",{"$f":"IF((C143<>\"\")*AND(F143<>\"\"), C143*F143, \"\")","v":""},null,{"$f":"IF(E143=\"\", \"\", IF(E143=\"SD\",110,IF(E143=\"WS\",110,IF(E143=\"C\",110,IF(E143=\"TF\",70,IF(E143=\"PF\",85,110))))))","v":""},null,null,null,{"$f":"IF((H143<>\"\")*AND(J143<>\"\")*AND(C143<>\"\")*AND(E143<>\"\"), IF((H143<=G143)*AND(J143<=I143)*AND(P143+Q143+R143>1),\"PASS\",\"FAIL\"), \"INC\")","v":"INC"},{"$f":"IF((E143=\"C\")*AND(C143<>\"\")*AND(C143<100)*AND(H143<10),\"See Note 2) above in cell A5 & A6\",IF((E143=\"SD\")*AND(L143=\"Not Applicable\"),\"Regulated Power Supply Assumed\",\"\"))","v":""},{"$f":"IF(E143=\"WS\",0.6-(1-(110-J143)/(110-70))*(0.6-0.4),IF(E143=\"SD\",0.5-(1-(110-J143)/(110-70))*(0.5-0.3),D143))","v":""},{"$f":"IF((E143=\"SD\")*AND(K143>=1),1,IF(L143=$X$12,1,0))","v":0},{"$f":"IF(E143=\"SD\", IF((L143=$X$10)*AND(K143/H143>=0.3), 1, IF((L143=$X$11)*AND(K143/H143>=0.1), 1, IF(L143=$X$12, 1, 0))), 1)","v":1},{"$f":"IF(E143<>\"SD\",1,0)","v":1},{"$f":"IF(E143=\"SD\", IF(L143=$X$10, 0.3*H143, IF(L143=$X$11, 0.1*H143, (K143-1))), K143-1)","v":-1},{"$f":"IF(E143=\"SD\", IF(K143>=1, IF(K143>=S143, 0, 1), 1), 0)","v":0}]
[null,null,null,"",null,"","",null,"",null,null,null,"INC","","",0,1,1,-1,0]
[null,null,null,"",null,"","",null,"",null,null,null,"INC","","",0,1,1,-1,0]
[null,null,null,"",null,"","",null,"",null,null,null,"INC","","",0,1,1,-1,0]
[null,null,null,"",null,"","",null,"",null,null,null,"INC","","",0,1,1,-1,0]
[null,null,null,"",null,"","",null,"",null,null,null,"INC","","",0,1,1,-1,0]
[null,null,null,"",null,"","",null,"",null,null,null,"INC","","",0,1,1,-1,0]
[null,null,null,"",null,"","",null,"",null,null,null,"INC","","",0,1,1,-1,0]
[null,null,null,"",null,"","",null,"",null,null,null,"INC","","",0,1,1,-1,0]
[null,null,null,"",null,"","",null,"",null,null,null,"INC","","",0,1,1,-1,0]
[null,null,null,"",null,"","",null,"",null,null,null,"INC","","",0,1,1,-1,0]
[null,null,null,"",null,"","",null,"",null,null,null,"INC","","",0,1,1,-1,0]
[null,null,null,"",null,"","",null,"",null,null,null,"INC","","",0,1,1,-1,0]
[null,null,null,"",null,"","",null,"",null,null,null,"INC","","",0,1,1,-1,0]
[null,null,null,"",null,"","",null,"",null,null,null,"INC","","",0,1,1,-1,0]
[null,null,null,"",null,"","",null,"",null,null,null,"INC","","",0,1,1,-1,0]
[null,null,null,"",null,"","",null,"",null,null,null,"INC","","",0,1,1,-1,0]
[null,null,null,"",null,"","",null,"",null,null,null,"INC","","",0,1,1,-1,0]
[null,null,null,"",null,"","",null,"",null,null,null,"INC","","",0,1,1,-1,0]
[null,null,null,"",null,"","",null,"",null,null,null,"INC","","",0,1,1,-1,0]
[null,null,null,"",null,"","",null,"",null,null,null,"INC","","",0,1,1,-1,0]
[null,null,null,"",null,"","",null,"",null,null,null,"INC","","",0,1,1,-1,0]
[null,null,null,"",null,"","",null,"",null,null,null,"INC","","",0,1,1,-1,0]
[null,null,null,"",null,"","",null,"",null,null,null,"INC","","",0,1,1,-1,0]
[null,null,null,"",null,"","",null,"",null,null,null,"INC","","",0,1,1,-1,0]
[null,null,null,"",null,"","",null,"",null,null,null,"INC","","",0,1,1,-1,0]
[null,null,null,"",null,"","",null,"",null,null,null,"INC","","",0,1,1,-1,0]
[null,null,null,"",null,"","",null,"",null,null,null,"INC","","",0,1,1,-1,0]
[null,null,null,"",null,"","",null,"",null,null,null,"INC","","",0,1,1,-1,0]
[null,null,null,"",null,"","",null,"",null,null,null,"INC","","",0,1,1,-1,0]
[null,null,null,"",null,"","",null,"",null,null,null,"INC","","",0,1,1,-1,0]
[null,null,null,"",null,"","",null,"",null,null,null,"INC","","",0,1,1,-1,0]
[null,null,null,"",null,"","",null,"",null,null,null,"INC","","",0,1,1,-1,0]
[null,null,null,"",null,"","",null,"",null,null,null,"INC","","",0,1,1,-1,0]
[null,null,null,"",null,"","",null,"",null,null,null,"INC","","",0,1,1,-1,0]
[null,null,null,"",null,"","",null,"",null,null,null,"INC","","",0,1,1,-1,0]
[null,null,null,"",null,"","",null,"",null,null,null,"INC","","",0,1,1,-1,0]
[null,null,null,"",null,"","",null,"",null,null,null,"INC","","",0,1,1,-1,0]
[null,null,null,"",null,"","",null,"",null,null,null,"INC","","",0,1,1,-1,0]
[null,null,null,"",null,"","",null,"",null,null,null,"INC","","",0,1,1,-1,0]
[null,null,null,"",null,"","",null,"",null,null,null,"INC","","",0,1,1,-1,0]
[null,null,null,"",null,"","",null,"",null,null,null,"INC","","",0,1,1,-1,0]
[null,null,null,"",null,"","",null,"",null,null,null,"INC","","",0,1,1,-1,0]
[null,null,null,"",null,"","",null,"",null,null,null,"INC","","",0,1,1,-1,0]
[null,null,null,"",null,"","",null,"",null,null,null,"INC","","",0,1,1,-1,0]
[null,null,null,"",null,"","",null,"",null,null,null,"INC","","",0,1,1,-1,0]
[null,null,null,"",null,"","",null,"",null,null,null,"INC","","",0,1,1,-1,0]
[null,null,null,"",null,"","",null,"",null,null,null,"INC","","",0,1,1,-1,0]
[null,null,null,"",null,"","",null,"",null,null,null,"INC","","",0,1,1,-1,0]
[null,null,null,"",null,"","",null,"",null,null,null,"INC","","",0,1,1,-1,0]
[null,null,null,"",null,"","",null,"",null,null,null,"INC","","",0,1,1,-1,0]
[null,null,null,"",null,"","",null,"",null,null,null,"INC","","",0,1,1,-1,0]
[null,null,null,"",null,"","",null,"",null,null,null,"INC","","",0,1,1,-1,0]
[null,null,null,"",null,"","",null,"",null,null,null,"INC","","",0,1,1,-1,0]
[null,null,null,"",null,"","",null,"",null,null,null,"INC","","",0,1,1,-1,0]
[null,null,null,"",null,"","",null,"",null,null,null,"INC","","",0,1,1,-1,0]
[null,null,null,"",null,"","",null,"",null,null,null,"INC","","",0,1,1,-1,0]
[null,null,null,"",null,"","",null,"",null,null,null,"INC","","",0,1,1,-1,0]
[null,null,null,"",null,"","",null,"",null,null,null,"INC","","",0,1,1,-1,0]
[null,null,null,"",null,"","",null,"",null,null,null,"INC","","",0,1,1,-1,0]
[null,null,null,"",null,"","",null,"",null,null,null,"INC","","",0,1,1,-1,0]
[null,null,null,"",null,"","",null,"",null,null,null,"INC","","",0,1,1,-1,0]
[null,null,null,"",null,"","",null,"",null,null,null,"INC","","",0,1,1,-1,0]
[null,null,null,"",null,{"$f":"IF(ISBLANK(E206),D206,IF(J206>110,IF(E206=\"WS\",0.4,IF(E206=\"SD\",0.3)),(IF(J206>70,(IF(E206=\"WS\",0.6-(1-(110-J206)/(110-70))*(0.6-0.4),IF(E206=\"SD\",0.5-(1-(110-J206)/(110-70))*(0.5-0.3),D206))),D206))))","v":""},"",null,"",null,null,null,"INC","","",0,1,1,-1,0]
[null,null,null,{"$f":"IF(E207=\"\", \"\", IF(E207=\"C\",0.6,IF(E207=\"SD\",0.5,IF(E207=\"WS\",0.6,IF(E207=\"TF\",0.5,IF(E207=\"PF\",0.6,0.5))))))","v":""},null,"",{"$f":"IF((C207<>\"\")*AND(F207<>\"\"), C207*F207, \"\")","v":""},null,{"$f":"IF(E207=\"\", \"\", IF(E207=\"SD\",110,IF(E207=\"WS\",110,IF(E207=\"C\",110,IF(E207=\"TF\",70,IF(E207=\"PF\",85,110))))))","v":""},null,null,null,{"$f":"IF((H207<>\"\")*AND(J207<>\"\")*AND(C207<>\"\")*AND(E207<>\"\"), IF((H207<=G207)*AND(J207<=I207)*AND(P207+Q207+R207>1),\"PASS\",\"FAIL\"), \"INC\")","v":"INC"},{"$f":"IF((E207=\"C\")*AND(C207<>\"\")*AND(C207<100)*AND(H207<10),\"See Note 2) above in cell A5 & A6\",IF((E207=\"SD\")*AND(L207=\"Not Applicable\"),\"Regulated Power Supply Assumed\",\"\"))","v":""},{"$f":"IF(E207=\"WS\",0.6-(1-(110-J207)/(110-70))*(0.6-0.4),IF(E207=\"SD\",0.5-(1-(110-J207)/(110-70))*(0.5-0.3),D207))","v":""},{"$f":"IF((E207=\"SD\")*AND(K207>=1),1,IF(L207=$X$12,1,0))","v":0},{"$f":"IF(E207=\"SD\", IF((L207=$X$10)*AND(K207/H207>=0.3), 1, IF((L207=$X$11)*AND(K207/H207>=0.1), 1, IF(L207=$X$12, 1, 0))), 1)","v":1},{"$f":"IF(E207<>\"SD\",1,0)","v":1},{"$f":"IF(E207=\"SD\", IF(L207=$X$10, 0.3*H207, IF(L207=$X$11, 0.1*H207, (K207-1))), K207-1)","v":-1},{"$f":"IF(E207=\"SD\", IF(K207>=1, IF(K207>=S207, 0, 1), 1), 0)","v":0}]
[null,null,null,"",null,"","",null,"",null,null,null,"INC","","",0,1,1,-1,0]
[null,null,null,"",null,"","",null,"",null,null,null,"INC","","",0,1,1,-1,0]
[null,null,null,"",null,"","",null,"",null,null,null,"INC","","",0,1,1,-1,0]
[null,null,null,"",null,"","",null,"",null,null,null,"INC","","",0,1,1,-1,0]
[null,null,null,"",null,"","",null,"",null,null,null,"INC","","",0,1,1,-1,0]
[null,null,null,"",null,"","",null,"",null,null,null,"INC","","",0,1,1,-1,0]
[null,null,null,"",null,"","",null,"",null,null,null,"INC","","",0,1,1,-1,0]
[null,null,null,"",null,"","",null,"",null,null,null,"INC","","",0,1,1,-1,0]
[null,null,null,"",null,"","",null,"",null,null,null,"INC","","",0,1,1,-1,0]
[null,null,null,"",null,"","",null,"",null,null,null,"INC","","",0,1,1,-1,0]
[null,null,null,"",null,"","",null,"",null,null,null,"INC","","",0,1,1,-1,0]
[null,null,null,"",null,"","",null,"",null,null,null,"INC","","",0,1,1,-1,0]
[null,null,null,"",null,"","",null,"",null,null,null,"INC","","",0,1,1,-1,0]
[null,null,null,"",null,"","",null,"",null,null,null,"INC","","",0,1,1,-1,0]
[null,null,null,"",null,"","",null,"",null,null,null,"INC","","",0,1,1,-1,0]
[null,null,null,"",null,"","",null,"",null,null,null,"INC","","",0,1,1,-1,0]
[null,null,null,"",null,"","",null,"",null,null,null,"INC","","",0,1,1,-1,0]
[null,null,null,"",null,"","",null,"",null,null,null,"INC","","",0,1,1,-1,0]
[null,null,null,"",null,"","",null,"",null,null,null,"INC","","",0,1,1,-1,0]
[null,null,null,"",null,"","",null,"",null,null,null,"INC","","",0,1,1,-1,0]
[null,null,null,"",null,"","",null,"",null,null,null,"INC","","",0,1,1,-1,0]
[null,null,null,"",null,"","",null,"",null,null,null,"INC","","",0,1,1,-1,0]
[null,null,null,"",null,"","",null,"",null,null,null,"INC","","",0,1,1,-1,0]
[null,null,null,"",null,"","",null,"",null,null,null,"INC","","",0,1,1,-1,0]
[null,null,null,"",null,"","",null,"",null,null,null,"INC","","",0,1,1,-1,0]
[null,null,null,"",null,"","",null,"",null,null,null,"INC","","",0,1,1,-1,0]
[null,null,null,"",null,"","",null,"",null,null,null,"INC","","",0,1,1,-1,0]
[null,null,null,"",null,"","",null,"",null,null,null,"INC","","",0,1,1,-1,0]
[null,null,null,"",null,"","",null,"",null,null,null,"INC","","",0,1,1,-1,0]
[null,null,null,"",null,"","",null,"",null,null,null,"INC","","",0,1,1,-1,0]
[null,null,null,"",null,"","",null,"",null,null,null,"INC","","",0,1,1,-1,0]
[null,null,null,"",null,"","",null,"",null,null,null,"INC","","",0,1,1,-1,0]
[null,null,null,"",null,"","",null,"",null,null,null,"INC","","",0,1,1,-1,0]
[null,null,null,"",null,"","",null,"",null,null,null,"INC","","",0,1,1,-1,0]
[null,null,null,"",null,"","",null,"",null,null,null,"INC","","",0,1,1,-1,0]
[null,null,null,"",null,"","",null,"",null,null,null,"INC","","",0,1,1,-1,0]
[null,null,null,"",null,"","",null,"",null,null,null,"INC","","",0,1,1,-1,0]
[null,null,null,"",null,"","",null,"",null,null,null,"INC","","",0,1,1,-1,0]
[null,null,null,"",null,"","",null,"",null,null,null,"INC","","",0,1,1,-1,0]
[null,null,null,"",null,"","",null,"",null,null,null,"INC","","",0,1,1,-1,0]
[null,null,null,"",null,"","",null,"",null,null,null,"INC","","",0,1,1,-1,0]
[null,null,null,"",null,"","",null,"",null,null,null,"INC","","",0,1,1,-1,0]
[null,null,null,"",null,"","",null,"",null,null,null,"INC","","",0,1,1,-1,0]
[null,null,null,"",null,"","",null,"",null,null,null,"INC","","",0,1,1,-1,0]
[null,null,null,"",null,"","",null,"",null,null,null,"INC","","",0,1,1,-1,0]
[null,null,null,"",null,"","",null,"",null,null,null,"INC","","",0,1,1,-1,0]
[null,null,null,"",null,"","",null,"",null,null,null,"INC","","",0,1,1,-1,0]
[null,null,null,"",null,"","",null,"",null,null,null,"INC","","",0,1,1,-1,0]
[null,null,null,"",null,"","",null,"",null,null,null,"INC","","",0,1,1,-1,0]
[null,null,null,"",null,"","",null,"",null,null,null,"INC","","",0,1,1,-1,0]
[null,null,null,"",null,"","",null,"",null,null,null,"INC","","",0,1,1,-1,0]
[null,null,null,"",null,"","",null,"",null,null,null,"INC","","",0,1,1,-1,0]
[null,null,null,"",null,"","",null,"",null,null,null,"INC","","",0,1,1,-1,0]
[null,null,null,"",null,"","",null,"",null,null,null,"INC","","",0,1,1,-1,0]
[null,null,null,"",null,"","",null,"",null,null,null,"INC","","",0,1,1,-1,0]
[null,null,null,"",null,"","",null,"",null,null,null,"INC","","",0,1,1,-1,0]
[null,null,null,"",null,"","",null,"",null,null,null,"INC","","",0,1,1,-1,0]
[null,null,null,"",null,"","",null,"",null,null,null,"INC","","",0,1,1,-1,0]
[null,null,null,"",null,"","",null,"",null,null,null,"INC","","",0,1,1,-1,0]
[null,null,null,"",null,"","",null,"",null,null,null,"INC","","",0,1,1,-1,0]
[null,null,null,"",null,"","",null,"",null,null,null,"INC","","",0,1,1,-1,0]
[null,null,null,"",null,"","",null,"",null,null,null,"INC","","",0,1,1,-1,0]
[null,null,null,"",null,{"$f":"IF(ISBLANK(E270),D270,IF(J270>110,IF(E270=\"WS\",0.4,IF(E270=\"SD\",0.3)),(IF(J270>70,(IF(E270=\"WS\",0.6-(1-(110-J270)/(110-70))*(0.6-0.4),IF(E270=\"SD\",0.5-(1-(110-J270)/(110-70))*(0.5-0.3),D270))),D270))))","v":""},"",null,"",null,null,null,"INC","","",0,1,1,-1,0]
[null,null,null,{"$f":"IF(E271=\"\", \"\", IF(E271=\"C\",0.6,IF(E271=\"SD\",0.5,IF(E271=\"WS\",0.6,IF(E271=\"TF\",0.5,IF(E271=\"PF\",0.6,0.5))))))","v":""},null,"",{"$f":"IF((C271<>\"\")*AND(F271<>\"\"), C271*F271, \"\")","v":""},null,{"$f":"IF(E271=\"\", \"\", IF(E271=\"SD\",110,IF(E271=\"WS\",110,IF(E271=\"C\",110,IF(E271=\"TF\",70,IF(E271=\"PF\",85,110))))))","v":""},null,null,null,{"$f":"IF((H271<>\"\")*AND(J271<>\"\")*AND(C271<>\"\")*AND(E271<>\"\"), IF((H271<=G271)*AND(J271<=I271)*AND(P271+Q271+R271>1),\"PASS\",\"FAIL\"), \"INC\")","v":"INC"},{"$f":"IF((E271=\"C\")*AND(C271<>\"\")*AND(C271<100)*AND(H271<10),\"See Note 2) above in cell A5 & A6\",IF((E271=\"SD\")*AND(L271=\"Not Applicable\"),\"Regulated Power Supply Assumed\",\"\"))","v":""},{"$f":"IF(E271=\"WS\",0.6-(1-(110-J271)/(110-70))*(0.6-0.4),IF(E271=\"SD\",0.5-(1-(110-J271)/(110-70))*(0.5-0.3),D271))","v":""},{"$f":"IF((E271=\"SD\")*AND(K271>=1),1,IF(L271=$X$12,1,0))","v":0},{"$f":"IF(E271=\"SD\", IF((L271=$X$10)*AND(K271/H271>=0.3), 1, IF((L271=$X$11)*AND(K271/H271>=0.1), 1, IF(L271=$X$12, 1, 0))), 1)","v":1},{"$f":"IF(E271<>\"SD\",1,0)","v":1},{"$f":"IF(E271=\"SD\", IF(L271=$X$10, 0.3*H271, IF(L271=$X$11, 0.1*H271, (K271-1))), K271-1)","v":-1},{"$f":"IF(E271=\"SD\", IF(K271>=1, IF(K271>=S271, 0, 1), 1), 0)","v":0}]
[null,null,null,"",null,"","",null,"",null,null,null,"INC","","",0,1,1,-1,0]
[null,null,null,"",null,"","",null,"",null,null,null,"INC","","",0,1,1,-1,0]
[null,null,null,"",null,"","",null,"",null,null,null,"INC","","",0,1,1,-1,0]
[null,null,null,"",null,"","",null,"",null,null,null,"INC","","",0,1,1,-1,0]
[null,null,null,"",null,"","",null,"",null,null,null,"INC","","",0,1,1,-1,0]
[null,null,null,"",null,"","",null,"",null,null,null,"INC","","",0,1,1,-1,0]
[null,null,null,"",null,"","",null,"",null,null,null,"INC","","",0,1,1,-1,0]
[null,null,null,"",null,"","",null,"",null,null,null,"INC","","",0,1,1,-1,0]
[null,null,null,"",null,"","",null,"",null,null,null,"INC","","",0,1,1,-1,0]
[null,null,null,"",null,"","",null,"",null,null,null,"INC","","",0,1,1,-1,0]
[null,null,null,"",null,"","",null,"",null,null,null,"INC","","",0,1,1,-1,0]
[null,null,null,"",null,"","",null,"",null,null,null,"INC","","",0,1,1,-1,0]
[null,null,null,"",null,"","",null,"",null,null,null,"INC","","",0,1,1,-1,0]
[null,null,null,"",null,"","",null,"",null,null,null,"INC","","",0,1,1,-1,0]
[null,null,null,"",null,"","",null,"",null,null,null,"INC","","",0,1,1,-1,0]
[null,null,null,"",null,"","",null,"",null,null,null,"INC","","",0,1,1,-1,0]
[null,null,null,"",null,"","",null,"",null,null,null,"INC","","",0,1,1,-1,0]
[null,null,null,"",null,"","",null,"",null,null,null,"INC","","",0,1,1,-1,0]
[null,null,null,"",null,"","",null,"",null,null,null,"INC","","",0,1,1,-1,0]
[null,null,null,"",null,"","",null,"",null,null,null,"INC","","",0,1,1,-1,0]
[null,null,null,"",null,"","",null,"",null,null,null,"INC","","",0,1,1,-1,0]
[null,null,null,"",null,"","",null,"",null,null,null,"INC","","",0,1,1,-1,0]
[null,null,null,"",null,"","",null,"",null,null,null,"INC","","",0,1,1,-1,0]
[null,null,null,"",null,"","",null,"",null,null,null,"INC","","",0,1,1,-1,0]
[null,null,null,"",null,"","",null,"",null,null,null,"INC","","",0,1,1,-1,0]
[null,null,null,"",null,"","",null,"",null,null,null,"INC","","",0,1,1,-1,0]
[null,null,null,"",null,"","",null,"",null,null,null,"INC","","",0,1,1,-1,0]
[null,null,null,"",null,"","",null,"",null,null,null,"INC","","",0,1,1,-1,0]
[null,null,null,"",null,"","",null,"",null,null,null,"INC","","",0,1,1,-1,0]
[null,null,null,"",null,"","",null,"",null,null,null,"INC","","",0,1,1,-1,0]
[null,null,null,"",null,"","",null,"",null,null,null,"INC","","",0,1,1,-1,0]
[null,null,null,"",null,"","",null,"",null,null,null,"INC","","",0,1,1,-1,0]
[null,null,null,"",null,"","",null,"",null,null,null,"INC","","",0,1,1,-1,0]
[null,null,null,"",null,"","",null,"",null,null,null,"INC","","",0,1,1,-1,0]
[null,null,null,"",null,"","",null,"",null,null,null,"INC","","",0,1,1,-1,0]
[null,null,null,"",null,"","",null,"",null,null,null,"INC","","",0,1,1,-1,0]
[null,null,null,"",null,"","",null,"",null,null,null,"INC","","",0,1,1,-1,0]
[null,null,null,"",null,"","",null,"",null,null,null,"INC","","",0,1,1,-1,0]
[null,null,null,"",null,"","",null,"",null,null,null,"INC","","",0,1,1,-1,0]
[null,null,null,"",null,"","",null,"",null,null,null,"INC","","",0,1,1,-1,0]
[null,null,null,"",null,"","",null,"",null,null,null,"INC","","",0,1,1,-1,0]
[null,null,null,"",null,"","",null,"",null,null,null,"INC","","",0,1,1,-1,0]
[null,null,null,"",null,"","",null,"",null,null,null,"INC","","",0,1,1,-1,0]
[null,null,null,"",null,"","",null,"",null,null,null,"INC","","",0,1,1,-1,0]
[null,null,null,"",null,"","",null,"",null,null,null,"INC","","",0,1,1,-1,0]
[null,null,null,"",null,"","",null,"",null,null,null,"INC","","",0,1,1,-1,0]
[null,null,null,"",null,"","",null,"",null,null,null,"INC","","",0,1,1,-1,0]
[null,null,null,"",null,"","",null,"",null,null,null,"INC","","",0,1,1,-1,0]
[null,null,null,"",null,"","",null,"",null,null,null,"INC","","",0,1,1,-1,0]
[null,null,null,"",null,"","",null,"",null,null,null,"INC","","",0,1,1,-1,0]
[null,null,null,"",null,"","",null,"",null,null,null,"INC","","",0,1,1,-1,0]
[null,null,null,"",null,"","",null,"",null,null,null,"INC","","",0,1,1,-1,0]
[null,null,null,"",null,"","",null,"",null,null,null,"INC","","",0,1,1,-1,0]
[null,null,null,"",null,"","",null,"",null,null,null,"INC","","",0,1,1,-1,0]
[null,null,null,"",null,"","",null,"",null,null,null,"INC","","",0,1,1,-1,0]
[null,null,null,"",null,"","",null,"",null,null,null,"INC","","",0,1,1,-1,0]
[null,null,null,"",null,"","",null,"",null,null,null,"INC","","",0,1,1,-1,0]
[null,null,null,"",null,"","",null,"",null,null,null,"INC","","",0,1,1,-1,0]
[null,null,null,"",null,"","",null,"",null,null,null,"INC","","",0,1,1,-1,0]
[null,null,null,"",null,"","",null,"",null,null,null,"INC","","",0,1,1,-1,0]
[null,null,null,"",null,"","",null,"",null,null,null,"INC","","",0,1,1,-1,0]
[null,null,null,"",null,"","",null,"",null,null,null,"INC","","",0,1,1,-1,0]
[null,null,null,"",null,{"$f":"IF(ISBLANK(E334),D334,IF(J334>110,IF(E334=\"WS\",0.4,IF(E334=\"SD\",0.3)),(IF(J334>70,(IF(E334=\"WS\",0.6-(1-(110-J334)/(110-70))*(0.6-0.4),IF(E334=\"SD\",0.5-(1-(110-J334)/(110-70))*(0.5-0.3),D334))),D334))))","v":""},"",null,"",null,null,null,"INC","","",0,1,1,-1,0]
[null,null,null,{"$f":"IF(E335=\"\", \"\", IF(E335=\"C\",0.6,IF(E335=\"SD\",0.5,IF(E335=\"WS\",0.6,IF(E335=\"TF\",0.5,IF(E335=\"PF\",0.6,0.5))))))","v":""},null,"",{"$f":"IF((C335<>\"\")*AND(F335<>\"\"), C335*F335, \"\")","v":""},null,{"$f":"IF(E335=\"\", \"\", IF(E335=\"SD\",110,IF(E335=\"WS\",110,IF(E335=\"C\",110,IF(E335=\"TF\",70,IF(E335=\"PF\",85,110))))))","v":""},null,null,null,{"$f":"IF((H335<>\"\")*AND(J335<>\"\")*AND(C335<>\"\")*AND(E335<>\"\"), IF((H335<=G335)*AND(J335<=I335)*AND(P335+Q335+R335>1),\"PASS\",\"FAIL\"), \"INC\")","v":"INC"},{"$f":"IF((E335=\"C\")*AND(C335<>\"\")*AND(C335<100)*AND(H335<10),\"See Note 2) above in cell A5 & A6\",IF((E335=\"SD\")*AND(L335=\"Not Applicable\"),\"Regulated Power Supply Assumed\",\"\"))","v":""},{"$f":"IF(E335=\"WS\",0.6-(1-(110-J335)/(110-70))*(0.6-0.4),IF(E335=\"SD\",0.5-(1-(110-J335)/(110-70))*(0.5-0.3),D335))","v":""},{"$f":"IF((E335=\"SD\")*AND(K335>=1),1,IF(L335=$X$12,1,0))","v":0},{"$f":"IF(E335=\"SD\", IF((L335=$X$10)*AND(K335/H335>=0.3), 1, IF((L335=$X$11)*AND(K335/H335>=0.1), 1, IF(L335=$X$12, 1, 0))), 1)","v":1},{"$f":"IF(E335<>\"SD\",1,0)","v":1},{"$f":"IF(E335=\"SD\", IF(L335=$X$10, 0.3*H335, IF(L335=$X$11, 0.1*H335, (K335-1))), K335-1)","v":-1},{"$f":"IF(E335=\"SD\", IF(K335>=1, IF(K335>=S335, 0, 1), 1), 0)","v":0}]
[null,null,null,"",null,"","",null,"",null,null,null,"INC","","",0,1,1,-1,0]
[null,null,null,"",null,"","",null,"",null,null,null,"INC","","",0,1,1,-1,0]
[null,null,null,"",null,"","",null,"",null,null,null,"INC","","",0,1,1,-1,0]
[null,null,null,"",null,"","",null,"",null,null,null,"INC","","",0,1,1,-1,0]
[null,null,null,"",null,"","",null,"",null,null,null,"INC","","",0,1,1,-1,0]
[null,null,null,"",null,"","",null,"",null,null,null,"INC","","",0,1,1,-1,0]
[null,null,null,"",null,"","",null,"",null,null,null,"INC","","",0,1,1,-1,0]
[null,null,null,"",null,"","",null,"",null,null,null,"INC","","",0,1,1,-1,0]
[null,null,null,"",null,"","",null,"",null,null,null,"INC","","",0,1,1,-1,0]
[null,null,null,"",null,"","",null,"",null,null,null,"INC","","",0,1,1,-1,0]
[null,null,null,"",null,"","",null,"",null,null,null,"INC","","",0,1,1,-1,0]
[null,null,null,"",null,"","",null,"",null,null,null,"INC","","",0,1,1,-1,0]
[null,null,null,"",null,"","",null,"",null,null,null,"INC","","",0,1,1,-1,0]
[null,null,null,"",null,"","",null,"",null,null,null,"INC","","",0,1,1,-1,0]
[null,null,null,"",null,"","",null,"",null,null,null,"INC","","",0,1,1,-1,0]
[null,null,null,"",null,"","",null,"",null,null,null,"INC","","",0,1,1,-1,0]
[null,null,null,"",null,"","",null,"",null,null,null,"INC","","",0,1,1,-1,0]
[null,null,null,"",null,"","",null,"",null,null,null,"INC","","",0,1,1,-1,0]
[null,null,null,"",null,"","",null,"",null,null,null,"INC","","",0,1,1,-1,0]
[null,null,null,"",null,"","",null,"",null,null,null,"INC","","",0,1,1,-1,0]
[null,null,null,"",null,"","",null,"",null,null,null,"INC","","",0,1,1,-1,0]
[null,null,null,"",null,"","",null,"",null,null,null,"INC","","",0,1,1,-1,0]
[null,null,null,"",null,"","",null,"",null,null,null,"INC","","",0,1,1,-1,0]
[null,null,null,"",null,"","",null,"",null,null,null,"INC","","",0,1,1,-1,0]
[null,null,null,"",null,"","",null,"",null,null,null,"INC","","",0,1,1,-1,0]
[null,null,null,"",null,"","",null,"",null,null,null,"INC","","",0,1,1,-1,0]
[null,null,null,"",null,"","",null,"",null,null,null,"INC","","",0,1,1,-1,0]
[null,null,null,"",null,"","",null,"",null,null,null,"INC","","",0,1,1,-1,0]
[null,null,null,"",null,"","",null,"",null,null,null,"INC","","",0,1,1,-1,0]
[null,null,null,"",null,"","",null,"",null,null,null,"INC","","",0,1,1,-1,0]
[null,null,null,"",null,"","",null,"",null,null,null,"INC","","",0,1,1,-1,0]
[null,null,null,"",null,"","",null,"",null,null,null,"INC","","",0,1,1,-1,0]
[null,null,null,"",null,"","",null,"",null,null,null,"INC","","",0,1,1,-1,0]
[null,null,null,"",null,"","",null,"",null,null,null,"INC","","",0,1,1,-1,0]
[null,null,null,"",null,"","",null,"",null,null,null,"INC","","",0,1,1,-1,0]
[null,null,null,"",null,"","",null,"",null,null,null,"INC","","",0,1,1,-1,0]
[null,null,null,"",null,"","",null,"",null,null,null,"INC","","",0,1,1,-1,0]
[null,null,null,"",null,"","",null,"",null,null,null,"INC","","",0,1,1,-1,0]
[null,null,null,"",null,"","",null,"",null,null,null,"INC","","",0,1,1,-1,0]
[null,null,null,"",null,"","",null,"",null,null,null,"INC","","",0,1,1,-1,0]
[null,null,null,"",null,"","",null,"",null,null,null,"INC","","",0,1,1,-1,0]
[null,null,null,"",null,"","",null,"",null,null,null,"INC","","",0,1,1,-1,0]
[null,null,null,"",null,"","",null,"",null,null,null,"INC","","",0,1,1,-1,0]
[null,null,null,"",null,"","",null,"",null,null,null,"INC","","",0,1,1,-1,0]
[null,null,null,"",null,"","",null,"",null,null,null,"INC","","",0,1,1,-1,0]
[null,null,null,"",null,"","",null,"",null,null,null,"INC","","",0,1,1,-1,0]
[null,null,null,"",null,"","",null,"",null,null,null,"INC","","",0,1,1,-1,0]
[null,null,null,"",null,"","",null,"",null,null,null,"INC","","",0,1,1,-1,0]
[null,null,null,"",null,"","",null,"",null,null,null,"INC","","",0,1,1,-1,0]
[null,null,null,"",null,"","",null,"",null,null,null,"INC","","",0,1,1,-1,0]
[null,null,null,"",null,"","",null,"",null,null,null,"INC","","",0,1,1,-1,0]
[null,null,null,"",null,"","",null,"",null,null,null,"INC","","",0,1,1,-1,0]
[null,null,null,"",null,"","",null,"",null,null,null,"INC","","",0,1,1,-1,0]
[null,null,null,"",null,"","",null,"",null,null,null,"INC","","",0,1,1,-1,0]
[null,null,null,"",null,"","",null,"",null,null,null,"INC","","",0,1,1,-1,0]
[null,null,null,"",null,"","",null,"",null,null,null,"INC","","",0,1,1,-1,0]
[null,null,null,"",null,"","",null,"",null,null,null,"INC","","",0,1,1,-1,0]
[null,null,null,"",null,"","",null,"",null,null,null,"INC","","",0,1,1,-1,0]
[null,null,null,"",null,"","",null,"",null,null,null,"INC","","",0,1,1,-1,0]
[null,null,null,"",null,"","",null,"",null,null,null,"INC","","",0,1,1,-1,0]
[null,null,null,"",null,"","",null,"",null,null,null,"INC","","",0,1,1,-1,0]
[null,null,null,"",null,"","",null,"",null,null,null,"INC","","",0,1,1,-1,0]
[null,null,null,"",null,{"$f":"IF(ISBLANK(E398),D398,IF(J398>110,IF(E398=\"WS\",0.4,IF(E398=\"SD\",0.3)),(IF(J398>70,(IF(E398=\"WS\",0.6-(1-(110-J398)/(110-70))*(0.6-0.4),IF(E398=\"SD\",0.5-(1-(110-J398)/(110-70))*(0.5-0.3),D398))),D398))))","v":""},"",null,"",null,null,null,"INC","","",0,1,1,-1,0]
[null,null,null,{"$f":"IF(E399=\"\", \"\", IF(E399=\"C\",0.6,IF(E399=\"SD\",0.5,IF(E399=\"WS\",0.6,IF(E399=\"TF\",0.5,IF(E399=\"PF\",0.6,0.5))))))","v":""},null,"",{"$f":"IF((C399<>\"\")*AND(F399<>\"\"), C399*F399, \"\")","v":""},null,{"$f":"IF(E399=\"\", \"\", IF(E399=\"SD\",110,IF(E399=\"WS\",110,IF(E399=\"C\",110,IF(E399=\"TF\",70,IF(E399=\"PF\",85,110))))))","v":""},null,null,null,{"$f":"IF((H399<>\"\")*AND(J399<>\"\")*AND(C399<>\"\")*AND(E399<>\"\"), IF((H399<=G399)*AND(J399<=I399)*AND(P399+Q399+R399>1),\"PASS\",\"FAIL\"), \"INC\")","v":"INC"},{"$f":"IF((E399=\"C\")*AND(C399<>\"\")*AND(C399<100)*AND(H399<10),\"See Note 2) above in cell A5 & A6\",IF((E399=\"SD\")*AND(L399=\"Not Applicable\"),\"Regulated Power Supply Assumed\",\"\"))","v":""},{"$f":"IF(E399=\"WS\",0.6-(1-(110-J399)/(110-70))*(0.6-0.4),IF(E399=\"SD\",0.5-(1-(110-J399)/(110-70))*(0.5-0.3),D399))","v":""},{"$f":"IF((E399=\"SD\")*AND(K399>=1),1,IF(L399=$X$12,1,0))","v":0},{"$f":"IF(E399=\"SD\", IF((L399=$X$10)*AND(K399/H399>=0.3), 1, IF((L399=$X$11)*AND(K399/H399>=0.1), 1, IF(L399=$X$12, 1, 0))), 1)","v":1},{"$f":"IF(E399<>\"SD\",1,0)","v":1},{"$f":"IF(E399=\"SD\", IF(L399=$X$10, 0.3*H399, IF(L399=$X$11, 0.1*H399, (K399-1))), K399-1)","v":-1},{"$f":"IF(E399=\"SD\", IF(K399>=1, IF(K399>=S399, 0, 1), 1), 0)","v":0}]
[null,null,null,"",null,"","",null,"",null,null,null,"INC","","",0,1,1,-1,0]
[null,null,null,"",null,"","",null,"",null,null,null,"INC","","",0,1,1,-1,0]
[null,null,null,"",null,"","",null,"",null,null,null,"INC","","",0,1,1,-1,0]
[null,null,null,"",null,"","",null,"",null,null,null,"INC","","",0,1,1,-1,0]
[null,null,null,"",null,"","",null,"",null,null,null,"INC","","",0,1,1,-1,0]
[null,null,null,"",null,"","",null,"",null,null,null,"INC","","",0,1,1,-1,0]
[null,null,null,"",null,"","",null,"",null,null,null,"INC","","",0,1,1,-1,0]
[null,null,null,"",null,"","",null,"",null,null,null,"INC","","",0,1,1,-1,0]
[null,null,null,"",null,"","",null,"",null,null,null,"INC","","",0,1,1,-1,0]
[null,null,null,"",null,"","",null,"",null,null,null,"INC","","",0,1,1,-1,0]
[null,null,null,"",null,"","",null,"",null,null,null,"INC","","",0,1,1,-1,0]
[null,null,null,"",null,"","",null,"",null,null,null,"INC","","",0,1,1,-1,0]
[null,null,null,"",null,"","",null,"",null,null,null,"INC","","",0,1,1,-1,0]
[null,null,null,"",null,"","",null,"",null,null,null,"INC","","",0,1,1,-1,0]
[null,null,null,"",null,"","",null,"",null,null,null,"INC","","",0,1,1,-1,0]
[null,null,null,"",null,"","",null,"",null,null,null,"INC","","",0,1,1,-1,0]
[null,null,null,"",null,"","",null,"",null,null,null,"INC","","",0,1,1,-1,0]
[null,null,null,"",null,"","",null,"",null,null,null,"INC","","",0,1,1,-1,0]
[null,null,null,"",null,"","",null,"",null,null,null,"INC","","",0,1,1,-1,0]
[null,null,null,"",null,"","",null,"",null,null,null,"INC","","",0,1,1,-1,0]
[null,null,null,"",null,"","",null,"",null,null,null,"INC","","",0,1,1,-1,0]
[null,null,null,"",null,"","",null,"",null,null,null,"INC","","",0,1,1,-1,0]
[null,null,null,"",null,"","",null,"",null,null,null,"INC","","",0,1,1,-1,0]
[null,null,null,"",null,"","",null,"",null,null,null,"INC","","",0,1,1,-1,0]
[null,null,null,"",null,"","",null,"",null,null,null,"INC","","",0,1,1,-1,0]
[null,null,null,"",null,"","",null,"",null,null,null,"INC","","",0,1,1,-1,0]
[null,null,null,"",null,"","",null,"",null,null,null,"INC","","",0,1,1,-1,0]
[null,null,null,"",null,"","",null,"",null,null,null,"INC","","",0,1,1,-1,0]
[null,null,null,"",null,"","",null,"",null,null,null,"INC","","",0,1,1,-1,0]
[null,null,null,"",null,"","",null,"",null,null,null,"INC","","",0,1,1,-1,0]
[null,null,null,"",null,"","",null,"",null,null,null,"INC","","",0,1,1,-1,0]
[null,null,null,"",null,"","",null,"",null,null,null,"INC","","",0,1,1,-1,0]
[null,null,null,"",null,"","",null,"",null,null,null,"INC","","",0,1,1,-1,0]
[null,null,null,"",null,"","",null,"",null,null,null,"INC","","",0,1,1,-1,0]
[null,null,null,"",null,"","",null,"",null,null,null,"INC","","",0,1,1,-1,0]
[null,null,null,"",null,"","",null,"",null,null,null,"INC","","",0,1,1,-1,0]
[null,null,null,"",null,"","",null,"",null,null,null,"INC","","",0,1,1,-1,0]
[null,null,null,"",null,"","",null,"",null,null,null,"INC","","",0,1,1,-1,0]
[null,null,null,"",null,"","",null,"",null,null,null,"INC","","",0,1,1,-1,0]
[null,null,null,"",null,"","",null,"",null,null,null,"INC","","",0,1,1,-1,0]
[null,null,null,"",null,"","",null,"",null,null,null,"INC","","",0,1,1,-1,0]
[null,null,null,"",null,"","",null,"",null,null,null,"INC","","",0,1,1,-1,0]
[null,null,null,"",null,"","",null,"",null,null,null,"INC","","",0,1,1,-1,0]
[null,null,null,"",null,"","",null,"",null,null,null,"INC","","",0,1,1,-1,0]
[null,null,null,"",null,"","",null,"",null,null,null,"INC","","",0,1,1,-1,0]
[null,null,null,"",null,"","",null,"",null,null,null,"INC","","",0,1,1,-1,0]
[null,null,null,"",null,"","",null,"",null,null,null,"INC","","",0,1,1,-1,0]
[null,null,null,"",null,"","",null,"",null,null,null,"INC","","",0,1,1,-1,0]
[null,null,null,"",null,"","",null,"",null,null,null,"INC","","",0,1,1,-1,0]
[null,null,null,"",null,"","",null,"",null,null,null,"INC","","",0,1,1,-1,0]
[null,null,null,"",null,"","",null,"",null,null,null,"INC","","",0,1,1,-1,0]
[null,null,null,"",null,"","",null,"",null,null,null,"INC","","",0,1,1,-1,0]
[null,null,null,"",null,"","",null,"",null,null,null,"INC","","",0,1,1,-1,0]
[null,null,null,"",null,"","",null,"",null,null,null,"INC","","",0,1,1,-1,0]
[null,null,null,"",null,"","",null,"",null,null,null,"INC","","",0,1,1,-1,0]
[null,null,null,"",null,"","",null,"",null,null,null,"INC","","",0,1,1,-1,0]
[null,null,null,"",null,"","",null,"",null,null,null,"INC","","",0,1,1,-1,0]
[null,null,null,"",null,"","",null,"",null,null,null,"INC","","",0,1,1,-1,0]
[null,null,null,"",null,"","",null,"",null,null,null,"INC","","",0,1,1,-1,0]
[null,null,null,"",null,"","",null,"",null,null,null,"INC","","",0,1,1,-1,0]
[null,null,null,"",null,"","",null,"",null,null,null,"INC","","",0,1,1,-1,0]
[null,null,null,"",null,"","",null,"",null,null,null,"INC","","",0,1,1,-1,0]
[null,null,null,"",null,{"$f":"IF(ISBLANK(E462),D462,IF(J462>110,IF(E462=\"WS\",0.4,IF(E462=\"SD\",0.3)),(IF(J462>70,(IF(E462=\"WS\",0.6-(1-(110-J462)/(110-70))*(0.6-0.4),IF(E462=\"SD\",0.5-(1-(110-J462)/(110-70))*(0.5-0.3),D462))),D462))))","v":""},"",null,"",null,null,null,"INC","","",0,1,1,-1,0]
[null,null,null,{"$f":"IF(E463=\"\", \"\", IF(E463=\"C\",0.6,IF(E463=\"SD\",0.5,IF(E463=\"WS\",0.6,IF(E463=\"TF\",0.5,IF(E463=\"PF\",0.6,0.5))))))","v":""},null,"",{"$f":"IF((C463<>\"\")*AND(F463<>\"\"), C463*F463, \"\")","v":""},null,{"$f":"IF(E463=\"\", \"\", IF(E463=\"SD\",110,IF(E463=\"WS\",110,IF(E463=\"C\",110,IF(E463=\"TF\",70,IF(E463=\"PF\",85,110))))))","v":""},null,null,null,{"$f":"IF((H463<>\"\")*AND(J463<>\"\")*AND(C463<>\"\")*AND(E463<>\"\"), IF((H463<=G463)*AND(J463<=I463)*AND(P463+Q463+R463>1),\"PASS\",\"FAIL\"), \"INC\")","v":"INC"},{"$f":"IF((E463=\"C\")*AND(C463<>\"\")*AND(C463<100)*AND(H463<10),\"See Note 2) above in cell A5 & A6\",IF((E463=\"SD\")*AND(L463=\"Not Applicable\"),\"Regulated Power Supply Assumed\",\"\"))","v":""},{"$f":"IF(E463=\"WS\",0.6-(1-(110-J463)/(110-70))*(0.6-0.4),IF(E463=\"SD\",0.5-(1-(110-J463)/(110-70))*(0.5-0.3),D463))","v":""},{"$f":"IF((E463=\"SD\")*AND(K463>=1),1,IF(L463=$X$12,1,0))","v":0},{"$f":"IF(E463=\"SD\", IF((L463=$X$10)*AND(K463/H463>=0.3), 1, IF((L463=$X$11)*AND(K463/H463>=0.1), 1, IF(L463=$X$12, 1, 0))), 1)","v":1},{"$f":"IF(E463<>\"SD\",1,0)","v":1},{"$f":"IF(E463=\"SD\", IF(L463=$X$10, 0.3*H463, IF(L463=$X$11, 0.1*H463, (K463-1))), K463-1)","v":-1},{"$f":"IF(E463=\"SD\", IF(K463>=1, IF(K463>=S463, 0, 1), 1), 0)","v":0}]
[null,null,null,"",null,"","",null,"",null,null,null,"INC","","",0,1,1,-1,0]
[null,null,null,"",null,"","",null,"",null,null,null,"INC","","",0,1,1,-1,0]
[null,null,null,"",null,"","",null,"",null,null,null,"INC","","",0,1,1,-1,0]
[null,null,null,"",null,"","",null,"",null,null,null,"INC","","",0,1,1,-1,0]
[null,null,null,"",null,"","",null,"",null,null,null,"INC","","",0,1,1,-1,0]
[null,null,null,"",null,"","",null,"",null,null,null,"INC","","",0,1,1,-1,0]
[null,null,null,"",null,"","",null,"",null,null,null,"INC","","",0,1,1,-1,0]
[null,null,null,"",null,"","",null,"",null,null,null,"INC","","",0,1,1,-1,0]
[null,null,null,"",null,"","",null,"",null,null,null,"INC","","",0,1,1,-1,0]
[null,null,null,"",null,"","",null,"",null,null,null,"INC","","",0,1,1,-1,0]
[null,null,null,"",null,"","",null,"",null,null,null,"INC","","",0,1,1,-1,0]
[null,null,null,"",null,"","",null,"",null,null,null,"INC","","",0,1,1,-1,0]
[null,null,null,"",null,"","",null,"",null,null,null,"INC","","",0,1,1,-1,0]
[null,null,null,"",null,"","",null,"",null,null,null,"INC","","",0,1,1,-1,0]
[null,null,null,"",null,"","",null,"",null,null,null,"INC","","",0,1,1,-1,0]
[null,null,null,"",null,"","",null,"",null,null,null,"INC","","",0,1,1,-1,0]
[null,null,null,"",null,"","",null,"",null,null,null,"INC","","",0,1,1,-1,0]
[null,null,null,"",null,"","",null,"",null,null,null,"INC","","",0,1,1,-1,0]
[null,null,null,"",null,"","",null,"",null,null,null,"INC","","",0,1,1,-1,0]
[null,null,null,"",null,"","",null,"",null,null,null,"INC","","",0,1,1,-1,0]
[null,null,null,"",null,"","",null,"",null,null,null,"INC","","",0,1,1,-1,0]
[null,null,null,"",null,"","",null,"",null,null,null,"INC","","",0,1,1,-1,0]
[null,null,null,"",null,"","",null,"",null,null,null,"INC","","",0,1,1,-1,0]
[null,null,null,"",null,"","",null,"",null,null,null,"INC","","",0,1,1,-1,0]
[null,null,null,"",null,"","",null,"",null,null,null,"INC","","",0,1,1,-1,0]
[null,null,null,"",null,"","",null,"",null,null,null,"INC","","",0,1,1,-1,0]
[null,null,null,"",null,"","",null,"",null,null,null,"INC","","",0,1,1,-1,0]
[null,null,null,"",null,"","",null,"",null,null,null,"INC","","",0,1,1,-1,0]
[null,null,null,"",null,"","",null,"",null,null,null,"INC","","",0,1,1,-1,0]
[null,null,null,"",null,"","",null,"",null,null,null,"INC","","",0,1,1,-1,0]
[null,null,null,"",null,"","",null,"",null,null,null,"INC","","",0,1,1,-1,0]
[null,null,null,"",null,"","",null,"",null,null,null,"INC","","",0,1,1,-1,0]
[null,null,null,"",null,"","",null,"",null,null,null,"INC","","",0,1,1,-1,0]
[null,null,null,"",null,"","",null,"",null,null,null,"INC","","",0,1,1,-1,0]
[null,null,null,"",null,"","",null,"",null,null,null,"INC","","",0,1,1,-1,0]
[null,null,null,"",null,"","",null,"",null,null,null,"INC","","",0,1,1,-1,0]
[null,null,null,"",null,"","",null,"",null,null,null,"INC","","",0,1,1,-1,0]
[null,null,null,"",null,"","",null,"",null,null,null,"INC","","",0,1,1,-1,0]
[null,null,null,"",null,"","",null,"",null,null,null,"INC","","",0,1,1,-1,0]
[null,null,null,"",null,"","",null,"",null,null,null,"INC","","",0,1,1,-1,0]
[null,null,null,"",null,"","",null,"",null,null,null,"INC","","",0,1,1,-1,0]
[null,null,null,"",null,"","",null,"",null,null,null,"INC","","",0,1,1,-1,0]
[null,null,null,"",null,"","",null,"",null,null,null,"INC","","",0,1,1,-1,0]
[null,null,null,"",null,"","",null,"",null,null,null,"INC","","",0,1,1,-1,0]
[null,null,null,"",null,"","",null,"",null,null,null,"INC","","",0,1,1,-1,0]
[null,null,null,"",null,"","",null,"",null,null,null,"INC","","",0,1,1,-1,0]
[null,null,null,"",null,"","",null,"",null,null,null,"INC","","",0,1,1,-1,0]
[null,null,null,"",null,"","",null,"",null,null,null,"INC","","",0,1,1,-1,0]
[null,null,null,"",null,"","",null,"",null,null,null,"INC","","",0,1,1,-1,0]
[null,null,null,"",null,"","",null,"",null,null,null,"INC","","",0,1,1,-1,0]
[null,null,null,"",null,"","",null,"",null,null,null,"INC","","",0,1,1,-1,0]
[null,null,null,"",null,"","",null,"",null,null,null,"INC","","",0,1,1,-1,0]
[null,null,null,"",null,"","",null,"",null,null,null,"INC","","",0,1,1,-1,0]
[null,null,null,"",null,"","",null,"",null,null,null,"INC","","",0,1,1,-1,0]
[null,null,null,"",null,"","",null,"",null,null,null,"INC","","",0,1,1,-1,0]
[null,null,null,"",null,"","",null,"",null,null,null,"INC","","",0,1,1,-1,0]
[null,null,null,"",null,"","",null,"",null,null,null,"INC","","",0,1,1,-1,0]
[null,null,null,"",null,"","",null,"",null,null,null,"INC","","",0,1,1,-1,0]
[null,null,null,"",null,"","",null,"",null,null,null,"INC","","",0,1,1,-1,0]
[null,null,null,"",null,"","",null,"",null,null,null,"INC","","",0,1,1,-1,0]
[null,null,null,"",null,"","",null,"",null,null,null,"INC","","",0,1,1,-1,0]
[null,null,null,"",null,"","",null,"",null,null,null,"INC","","",0,1,1,-1,0]
[null,null,null,"",null,{"$f":"IF(ISBLANK(E526),D526,IF(J526>110,IF(E526=\"WS\",0.4,IF(E526=\"SD\",0.3)),(IF(J526>70,(IF(E526=\"WS\",0.6-(1-(110-J526)/(110-70))*(0.6-0.4),IF(E526=\"SD\",0.5-(1-(110-J526)/(110-70))*(0.5-0.3),D526))),D526))))","v":""},"",null,"",null,null,null,"INC","","",0,1,1,-1,0]
[null,null,null,{"$f":"IF(E527=\"\", \"\", IF(E527=\"C\",0.6,IF(E527=\"SD\",0.5,IF(E527=\"WS\",0.6,IF(E527=\"TF\",0.5,IF(E527=\"PF\",0.6,0.5))))))","v":""},null,"",{"$f":"IF((C527<>\"\")*AND(F527<>\"\"), C527*F527, \"\")","v":""},null,{"$f":"IF(E527=\"\", \"\", IF(E527=\"SD\",110,IF(E527=\"WS\",110,IF(E527=\"C\",110,IF(E527=\"TF\",70,IF(E527=\"PF\",85,110))))))","v":""},null,null,null,{"$f":"IF((H527<>\"\")*AND(J527<>\"\")*AND(C527<>\"\")*AND(E527<>\"\"), IF((H527<=G527)*AND(J527<=I527)*AND(P527+Q527+R527>1),\"PASS\",\"FAIL\"), \"INC\")","v":"INC"},{"$f":"IF((E527=\"C\")*AND(C527<>\"\")*AND(C527<100)*AND(H527<10),\"See Note 2) above in cell A5 & A6\",IF((E527=\"SD\")*AND(L527=\"Not Applicable\"),\"Regulated Power Supply Assumed\",\"\"))","v":""},{"$f":"IF(E527=\"WS\",0.6-(1-(110-J527)/(110-70))*(0.6-0.4),IF(E527=\"SD\",0.5-(1-(110-J527)/(110-70))*(0.5-0.3),D527))","v":""},{"$f":"IF((E527=\"SD\")*AND(K527>=1),1,IF(L527=$X$12,1,0))","v":0},{"$f":"IF(E527=\"SD\", IF((L527=$X$10)*AND(K527/H527>=0.3), 1, IF((L527=$X$11)*AND(K527/H527>=0.1), 1, IF(L527=$X$12, 1, 0))), 1)","v":1},{"$f":"IF(E527<>\"SD\",1,0)","v":1},{"$f":"IF(E527=\"SD\", IF(L527=$X$10, 0.3*H527, IF(L527=$X$11, 0.1*H527, (K527-1))), K527-1)","v":-1},{"$f":"IF(E527=\"SD\", IF(K527>=1, IF(K527>=S527, 0, 1), 1), 0)","v":0}]
[null,null,null,"",null,"","",null,"",null,null,null,"INC","","",0,1,1,-1,0]
[null,null,null,"",null,"","",null,"",null,null,null,"INC","","",0,1,1,-1,0]
[null,null,null,"",null,"","",null,"",null,null,null,"INC","","",0,1,1,-1,0]
[null,null,null,"",null,"","",null,"",null,null,null,"INC","","",0,1,1,-1,0]
[null,null,null,"",null,"","",null,"",null,null,null,"INC","","",0,1,1,-1,0]
[null,null,null,"",null,"","",null,"",null,null,null,"INC","","",0,1,1,-1,0]
[null,null,null,"",null,"","",null,"",null,null,null,"INC","","",0,1,1,-1,0]
[null,null,null,"",null,"","",null,"",null,null,null,"INC","","",0,1,1,-1,0]
[null,null,null,"",null,"","",null,"",null,null,null,"INC","","",0,1,1,-1,0]
[null,null,null,"",null,"","",null,"",null,null,null,"INC","","",0,1,1,-1,0]
[null,null,null,"",null,"","",null,"",null,null,null,"INC","","",0,1,1,-1,0]
[null,null,null,"",null,"","",null,"",null,null,null,"INC","","",0,1,1,-1,0]
[null,null,null,"",null,"","",null,"",null,null,null,"INC","","",0,1,1,-1,0]
[null,null,null,"",null,"","",null,"",null,null,null,"INC","","",0,1,1,-1,0]
[null,null,null,"",null,"","",null,"",null,null,null,"INC","","",0,1,1,-1,0]
[null,null,null,"",null,"","",null,"",null,null,null,"INC","","",0,1,1,-1,0]
[null,null,null,"",null,"","",null,"",null,null,null,"INC","","",0,1,1,-1,0]
[null,null,null,"",null,"","",null,"",null,null,null,"INC","","",0,1,1,-1,0]
[null,null,null,"",null,"","",null,"",null,null,null,"INC","","",0,1,1,-1,0]
[null,null,null,"",null,"","",null,"",null,null,null,"INC","","",0,1,1,-1,0]
[null,null,null,"",null,"","",null,"",null,null,null,"INC","","",0,1,1,-1,0]
[null,null,null,"",null,"","",null,"",null,null,null,"INC","","",0,1,1,-1,0]
[null,null,null,"",null,"","",null,"",null,null,null,"INC","","",0,1,1,-1,0]
[null,null,null,"",null,"","",null,"",null,null,null,"INC","","",0,1,1,-1,0]
[null,null,null,"",null,"","",null,"",null,null,null,"INC","","",0,1,1,-1,0]
[null,null,null,"",null,"","",null,"",null,null,null,"INC","","",0,1,1,-1,0]
[null,null,null,"",null,"","",null,"",null,null,null,"INC","","",0,1,1,-1,0]
[null,null,null,"",null,"","",null,"",null,null,null,"INC","","",0,1,1,-1,0]
[null,null,null,"",null,"","",null,"",null,null,null,"INC","","",0,1,1,-1,0]
[null,null,null,"",null,"","",null,"",null,null,null,"INC","","",0,1,1,-1,0]
[null,null,null,"",null,"","",null,"",null,null,null,"INC","","",0,1,1,-1,0]
[null,null,null,"",null,"","",null,"",null,null,null,"INC","","",0,1,1,-1,0]
[null,null,null,"",null,"","",null,"",null,null,null,"INC","","",0,1,1,-1,0]
[null,null,null,"",null,"","",null,"",null,null,null,"INC","","",0,1,1,-1,0]
[null,null,null,"",null,"","",null,"",null,null,null,"INC","","",0,1,1,-1,0]
[null,null,null,"",null,"","",null,"",null,null,null,"INC","","",0,1,1,-1,0]
[null,null,null,"",null,"","",null,"",null,null,null,"INC","","",0,1,1,-1,0]
[null,null,null,"",null,"","",null,"",null,null,null,"INC","","",0,1,1,-1,0]
[null,null,null,"",null,"","",null,"",null,null,null,"INC","","",0,1,1,-1,0]
[null,null,null,"",null,"","",null,"",null,null,null,"INC","","",0,1,1,-1,0]
[null,null,null,"",null,"","",null,"",null,null,null,"INC","","",0,1,1,-1,0]
[null,null,null,"",null,"","",null,"",null,null,null,"INC","","",0,1,1,-1,0]
[null,null,null,"",null,"","",null,"",null,null,null,"INC","","",0,1,1,-1,0]
[null,null,null,"",null,"","",null,"",null,null,null,"INC","","",0,1,1,-1,0]
[null,null,null,"",null,"","",null,"",null,null,null,"INC","","",0,1,1,-1,0]
[null,null,null,"",null,"","",null,"",null,null,null,"INC","","",0,1,1,-1,0]
[null,null,null,"",null,"","",null,"",null,null,null,"INC","","",0,1,1,-1,0]
[null,null,null,"",null,"","",null,"",null,null,null,"INC","","",0,1,1,-1,0]
[null,null,null,"",null,"","",null,"",null,null,null,"INC","","",0,1,1,-1,0]
[null,null,null,"",null,"","",null,"",null,null,null,"INC","","",0,1,1,-1,0]
[null,null,null,"",null,"","",null,"",null,null,null,"INC","","",0,1,1,-1,0]
[null,null,null,"",null,"","",null,"",null,null,null,"INC","","",0,1,1,-1,0]
[null,null,null,"",null,"","",null,"",null,null,null,"INC","","",0,1,1,-1,0]
[null,null,null,"",null,"","",null,"",null,null,null,"INC","","",0,1,1,-1,0]
[null,null,null,"",null,"","",null,"",null,null,null,"INC","","",0,1,1,-1,0]
[null,null,null,"",null,"","",null,"",null,null,null,"INC","","",0,1,1,-1,0]
[null,null,null,"",null,"","",null,"",null,null,null,"INC","","",0,1,1,-1,0]
[null,null,null,"",null,"","",null,"",null,null,null,"INC","","",0,1,1,-1,0]
[null,null,null,"",null,"","",null,"",null,null,null,"INC","","",0,1,1,-1,0]
[null,null,null,"",null,"","",null,"",null,null,null,"INC","","",0,1,1,-1,0]
[null,null,null,"",null,"","",null,"",null,null,null,"INC","","",0,1,1,-1,0]
[null,null,null,"",null,"","",null,"",null,null,null,"INC","","",0,1,1,-1,0]
[null,null,null,"",null,{"$f":"IF(ISBLANK(E590),D590,IF(J590>110,IF(E590=\"WS\",0.4,IF(E590=\"SD\",0.3)),(IF(J590>70,(IF(E590=\"WS\",0.6-(1-(110-J590)/(110-70))*(0.6-0.4),IF(E590=\"SD\",0.5-(1-(110-J590)/(110-70))*(0.5-0.3),D590))),D590))))","v":""},"",null,"",null,null,null,"INC","","",0,1,1,-1,0]
[null,null,null,{"$f":"IF(E591=\"\", \"\", IF(E591=\"C\",0.6,IF(E591=\"SD\",0.5,IF(E591=\"WS\",0.6,IF(E591=\"TF\",0.5,IF(E591=\"PF\",0.6,0.5))))))","v":""},null,"",{"$f":"IF((C591<>\"\")*AND(F591<>\"\"), C591*F591, \"\")","v":""},null,{"$f":"IF(E591=\"\", \"\", IF(E591=\"SD\",110,IF(E591=\"WS\",110,IF(E591=\"C\",110,IF(E591=\"TF\",70,IF(E591=\"PF\",85,110))))))","v":""},null,null,null,{"$f":"IF((H591<>\"\")*AND(J591<>\"\")*AND(C591<>\"\")*AND(E591<>\"\"), IF((H591<=G591)*AND(J591<=I591)*AND(P591+Q591+R591>1),\"PASS\",\"FAIL\"), \"INC\")","v":"INC"},{"$f":"IF((E591=\"C\")*AND(C591<>\"\")*AND(C591<100)*AND(H591<10),\"See Note 2) above in cell A5 & A6\",IF((E591=\"SD\")*AND(L591=\"Not Applicable\"),\"Regulated Power Supply Assumed\",\"\"))","v":""},{"$f":"IF(E591=\"WS\",0.6-(1-(110-J591)/(110-70))*(0.6-0.4),IF(E591=\"SD\",0.5-(1-(110-J591)/(110-70))*(0.5-0.3),D591))","v":""},{"$f":"IF((E591=\"SD\")*AND(K591>=1),1,IF(L591=$X$12,1,0))","v":0},{"$f":"IF(E591=\"SD\", IF((L591=$X$10)*AND(K591/H591>=0.3), 1, IF((L591=$X$11)*AND(K591/H591>=0.1), 1, IF(L591=$X$12, 1, 0))), 1)","v":1},{"$f":"IF(E591<>\"SD\",1,0)","v":1},{"$f":"IF(E591=\"SD\", IF(L591=$X$10, 0.3*H591, IF(L591=$X$11, 0.1*H591, (K591-1))), K591-1)","v":-1},{"$f":"IF(E591=\"SD\", IF(K591>=1, IF(K591>=S591, 0, 1), 1), 0)","v":0}]
[null,null,null,"",null,"","",null,"",null,null,null,"INC","","",0,1,1,-1,0]
[null,null,null,"",null,"","",null,"",null,null,null,"INC","","",0,1,1,-1,0]
[null,null,null,"",null,"","",null,"",null,null,null,"INC","","",0,1,1,-1,0]
[null,null,null,"",null,"","",null,"",null,null,null,"INC","","",0,1,1,-1,0]
[null,null,null,"",null,"","",null,"",null,null,null,"INC","","",0,1,1,-1,0]
[null,null,null,"",null,"","",null,"",null,null,null,"INC","","",0,1,1,-1,0]
[null,null,null,"",null,"","",null,"",null,null,null,"INC","","",0,1,1,-1,0]
[null,null,null,"",null,"","",null,"",null,null,null,"INC","","",0,1,1,-1,0]
[null,null,null,"",null,"","",null,"",null,null,null,"INC","","",0,1,1,-1,0]
[null,null,null,"",null,"","",null,"",null,null,null,"INC","","",0,1,1,-1,0]
[null,null,null,"",null,"","",null,"",null,null,null,"INC","","",0,1,1,-1,0]
[null,null,null,"",null,"","",null,"",null,null,null,"INC","","",0,1,1,-1,0]
[null,null,null,"",null,"","",null,"",null,null,null,"INC","","",0,1,1,-1,0]
[null,null,null,"",null,"","",null,"",null,null,null,"INC","","",0,1,1,-1,0]
[null,null,null,"",null,"","",null,"",null,null,null,"INC","","",0,1,1,-1,0]
[null,null,null,"",null,"","",null,"",null,null,null,"INC","","",0,1,1,-1,0]
[null,null,null,"",null,"","",null,"",null,null,null,"INC","","",0,1,1,-1,0]
[null,null,null,"",null,"","",null,"",null,null,null,"INC","","",0,1,1,-1,0]
[null,null,null,"",null,"","",null,"",null,null,null,"INC","","",0,1,1,-1,0]
[null,null,null,"",null,"","",null,"",null,null,null,"INC","","",0,1,1,-1,0]
[null,null,null,"",null,"","",null,"",null,null,null,"INC","","",0,1,1,-1,0]
[null,null,null,"",null,"","",null,"",null,null,null,"INC","","",0,1,1,-1,0]
[null,null,null,"",null,"","",null,"",null,null,null,"INC","","",0,1,1,-1,0]
[null,null,null,"",null,"","",null,"",null,null,null,"INC","","",0,1,1,-1,0]
[null,null,null,"",null,"","",null,"",null,null,null,"INC","","",0,1,1,-1,0]
[null,null,null,"",null,"","",null,"",null,null,null,"INC","","",0,1,1,-1,0]
[null,null,null,"",null,"","",null,"",null,null,null,"INC","","",0,1,1,-1,0]
[null,null,null,"",null,"","",null,"",null,null,null,"INC","","",0,1,1,-1,0]
[null,null,null,"",null,"","",null,"",null,null,null,"INC","","",0,1,1,-1,0]
[null,null,null,"",null,"","",null,"",null,null,null,"INC","","",0,1,1,-1,0]
[null,null,null,"",null,"","",null,"",null,null,null,"INC","","",0,1,1,-1,0]
[null,null,null,"",null,"","",null,"",null,null,null,"INC","","",0,1,1,-1,0]
[null,null,null,"",null,"","",null,"",null,null,null,"INC","","",0,1,1,-1,0]
[null,null,null,"",null,"","",null,"",null,null,null,"INC","","",0,1,1,-1,0]
[null,null,null,"",null,"","",null,"",null,null,null,"INC","","",0,1,1,-1,0]
[null,null,null,"",null,"","",null,"",null,null,null,"INC","","",0,1,1,-1,0]
[null,null,null,"",null,"","",null,"",null,null,null,"INC","","",0,1,1,-1,0]
[null,null,null,"",null,"","",null,"",null,null,null,"INC","","",0,1,1,-1,0]
[null,null,null,"",null,"","",null,"",null,null,null,"INC","","",0,1,1,-1,0]
[null,null,null,"",null,"","",null,"",null,null,null,"INC","","",0,1,1,-1,0]
[null,null,null,"",null,"","",null,"",null,null,null,"INC","","",0,1,1,-1,0]
[null,null,null,"",null,"","",null,"",null,null,null,"INC","","",0,1,1,-1,0]
[null,null,null,"",null,"","",null,"",null,null,null,"INC","","",0,1,1,-1,0]
[null,null,null,"",null,"","",null,"",null,null,null,"INC","","",0,1,1,-1,0]
[null,null,null,"",null,"","",null,"",null,null,null,"INC","","",0,1,1,-1,0]
[null,null,null,"",null,"","",null,"",null,null,null,"INC","","",0,1,1,-1,0]
[null,null,null,"",null,"","",null,"",null,null,null,"INC","","",0,1,1,-1,0]
[null,null,null,"",null,"","",null,"",null,null,null,"INC","","",0,1,1,-1,0]
[null,null,null,"",null,"","",null,"",null,null,null,"INC","","",0,1,1,-1,0]
[null,null,null,"",null,"","",null,"",null,null,null,"INC","","",0,1,1,-1,0]
[null,null,null,"",null,"","",null,"",null,null,null,"INC","","",0,1,1,-1,0]
[null,null,null,"",null,"","",null,"",null,null,null,"INC","","",0,1,1,-1,0]
[null,null,null,"",null,"","",null,"",null,null,null,"INC","","",0,1,1,-1,0]
[null,null,null,"",null,"","",null,"",null,null,null,"INC","","",0,1,1,-1,0]
[null,null,null,"",null,"","",null,"",null,null,null,"INC","","",0,1,1,-1,0]
[null,null,null,"",null,"","",null,"",null,null,null,"INC","","",0,1,1,-1,0]
[null,null,null,"",null,"","",null,"",null,null,null,"INC","","",0,1,1,-1,0]
[null,null,null,"",null,"","",null,"",null,null,null,"INC","","",0,1,1,-1,0]
[null,null,null,"",null,"","",null,"",null,null,null,"INC","","",0,1,1,-1,0]
[null,null,null,"",null,"","",null,"",null,null,null,"INC","","",0,1,1,-1,0]
[null,null,null,"",null,"","",null,"",null,null,null,"INC","","",0,1,1,-1,0]
[null,null,null,"",null,"","",null,"",null,null,null,"INC","","",0,1,1,-1,0]
[null,null,null,"",null,{"$f":"IF(ISBLANK(E654),D654,IF(J654>110,IF(E654=\"WS\",0.4,IF(E654=\"SD\",0.3)),(IF(J654>70,(IF(E654=\"WS\",0.6-(1-(110-J654)/(110-70))*(0.6-0.4),IF(E654=\"SD\",0.5-(1-(110-J654)/(110-70))*(0.5-0.3),D654))),D654))))","v":""},"",null,"",null,null,null,"INC","","",0,1,1,-1,0]
[null,null,null,{"$f":"IF(E655=\"\", \"\", IF(E655=\"C\",0.6,IF(E655=\"SD\",0.5,IF(E655=\"WS\",0.6,IF(E655=\"TF\",0.5,IF(E655=\"PF\",0.6,0.5))))))","v":""},null,"",{"$f":"IF((C655<>\"\")*AND(F655<>\"\"), C655*F655, \"\")","v":""},null,{"$f":"IF(E655=\"\", \"\", IF(E655=\"SD\",110,IF(E655=\"WS\",110,IF(E655=\"C\",110,IF(E655=\"TF\",70,IF(E655=\"PF\",85,110))))))","v":""},null,null,null,{"$f":"IF((H655<>\"\")*AND(J655<>\"\")*AND(C655<>\"\")*AND(E655<>\"\"), IF((H655<=G655)*AND(J655<=I655)*AND(P655+Q655+R655>1),\"PASS\",\"FAIL\"), \"INC\")","v":"INC"},{"$f":"IF((E655=\"C\")*AND(C655<>\"\")*AND(C655<100)*AND(H655<10),\"See Note 2) above in cell A5 & A6\",IF((E655=\"SD\")*AND(L655=\"Not Applicable\"),\"Regulated Power Supply Assumed\",\"\"))","v":""},{"$f":"IF(E655=\"WS\",0.6-(1-(110-J655)/(110-70))*(0.6-0.4),IF(E655=\"SD\",0.5-(1-(110-J655)/(110-70))*(0.5-0.3),D655))","v":""},{"$f":"IF((E655=\"SD\")*AND(K655>=1),1,IF(L655=$X$12,1,0))","v":0},{"$f":"IF(E655=\"SD\", IF((L655=$X$10)*AND(K655/H655>=0.3), 1, IF((L655=$X$11)*AND(K655/H655>=0.1), 1, IF(L655=$X$12, 1, 0))), 1)","v":1},{"$f":"IF(E655<>\"SD\",1,0)","v":1},{"$f":"IF(E655=\"SD\", IF(L655=$X$10, 0.3*H655, IF(L655=$X$11, 0.1*H655, (K655-1))), K655-1)","v":-1},{"$f":"IF(E655=\"SD\", IF(K655>=1, IF(K655>=S655, 0, 1), 1), 0)","v":0}]
[null,null,null,"",null,"","",null,"",null,null,null,"INC","","",0,1,1,-1,0]
[null,null,null,"",null,"","",null,"",null,null,null,"INC","","",0,1,1,-1,0]
[null,null,null,"",null,"","",null,"",null,null,null,"INC","","",0,1,1,-1,0]
[null,null,null,"",null,"","",null,"",null,null,null,"INC","","",0,1,1,-1,0]
[null,null,null,"",null,"","",null,"",null,null,null,"INC","","",0,1,1,-1,0]
[null,null,null,"",null,"","",null,"",null,null,null,"INC","","",0,1,1,-1,0]
[null,null,null,"",null,"","",null,"",null,null,null,"INC","","",0,1,1,-1,0]
[null,null,null,"",null,"","",null,"",null,null,null,"INC","","",0,1,1,-1,0]
[null,null,null,"",null,"","",null,"",null,null,null,"INC","","",0,1,1,-1,0]
[null,null,null,"",null,"","",null,"",null,null,null,"INC","","",0,1,1,-1,0]
[null,null,null,"",null,"","",null,"",null,null,null,"INC","","",0,1,1,-1,0]
[null,null,null,"",null,"","",null,"",null,null,null,"INC","","",0,1,1,-1,0]
[null,null,null,"",null,"","",null,"",null,null,null,"INC","","",0,1,1,-1,0]
[null,null,null,"",null,"","",null,"",null,null,null,"INC","","",0,1,1,-1,0]
[null,null,null,"",null,"","",null,"",null,null,null,"INC","","",0,1,1,-1,0]
[null,null,null,"",null,"","",null,"",null,null,null,"INC","","",0,1,1,-1,0]
[null,null,null,"",null,"","",null,"",null,null,null,"INC","","",0,1,1,-1,0]
[null,null,null,"",null,"","",null,"",null,null,null,"INC","","",0,1,1,-1,0]
[null,null,null,"",null,"","",null,"",null,null,null,"INC","","",0,1,1,-1,0]
[null,null,null,"",null,"","",null,"",null,null,null,"INC","","",0,1,1,-1,0]
[null,null,null,"",null,"","",null,"",null,null,null,"INC","","",0,1,1,-1,0]
[null,null,null,"",null,"","",null,"",null,null,null,"INC","","",0,1,1,-1,0]
[null,null,null,"",null,"","",null,"",null,null,null,"INC","","",0,1,1,-1,0]
[null,null,null,"",null,"","",null,"",null,null,null,"INC","","",0,1,1,-1,0]
[null,null,null,"",null,"","",null,"",null,null,null,"INC","","",0,1,1,-1,0]
[null,null,null,"",null,"","",null,"",null,null,null,"INC","","",0,1,1,-1,0]
[null,null,null,"",null,"","",null,"",null,null,null,"INC","","",0,1,1,-1,0]
[null,null,null,"",null,"","",null,"",null,null,null,"INC","","",0,1,1,-1,0]
[null,null,null,"",null,"","",null,"",null,null,null,"INC","","",0,1,1,-1,0]
[null,null,null,"",null,"","",null,"",null,null,null,"INC","","",0,1,1,-1,0]
[null,null,null,"",null,"","",null,"",null,null,null,"INC","","",0,1,1,-1,0]
[null,null,null,"",null,"","",null,"",null,null,null,"INC","","",0,1,1,-1,0]
[null,null,null,"",null,"","",null,"",null,null,null,"INC","","",0,1,1,-1,0]
[null,null,null,"",null,"","",null,"",null,null,null,"INC","","",0,1,1,-1,0]
[null,null,null,"",null,"","",null,"",null,null,null,"INC","","",0,1,1,-1,0]
[null,null,null,"",null,"","",null,"",null,null,null,"INC","","",0,1,1,-1,0]
[null,null,null,"",null,"","",null,"",null,null,null,"INC","","",0,1,1,-1,0]
[null,null,null,"",null,"","",null,"",null,null,null,"INC","","",0,1,1,-1,0]
[null,null,null,"",null,"","",null,"",null,null,null,"INC","","",0,1,1,-1,0]
[null,null,null,"",null,"","",null,"",null,null,null,"INC","","",0,1,1,-1,0]
[null,null,null,"",null,"","",null,"",null,null,null,"INC","","",0,1,1,-1,0]
[null,null,null,"",null,"","",null,"",null,null,null,"INC","","",0,1,1,-1,0]
[null,null,null,"",null,"","",null,"",null,null,null,"INC","","",0,1,1,-1,0]
[null,null,null,"",null,"","",null,"",null,null,null,"INC","","",0,1,1,-1,0]
[null,null,null,"",null,"","",null,"",null,null,null,"INC","","",0,1,1,-1,0]
[null,null,null,"",null,"","",null,"",null,null,null,"INC","","",0,1,1,-1,0]
[null,null,null,"",null,"","",null,"",null,null,null,"INC","","",0,1,1,-1,0]
[null,null,null,"",null,"","",null,"",null,null,null,"INC","","",0,1,1,-1,0]
[null,null,null,"",null,"","",null,"",null,null,null,"INC","","",0,1,1,-1,0]
[null,null,null,"",null,"","",null,"",null,null,null,"INC","","",0,1,1,-1,0]
[null,null,null,"",null,"","",null,"",null,null,null,"INC","","",0,1,1,-1,0]
[null,null,null,"",null,"","",null,"",null,null,null,"INC","","",0,1,1,-1,0]
[null,null,null,"",null,"","",null,"",null,null,null,"INC","","",0,1,1,-1,0]
[null,null,null,"",null,"","",null,"",null,null,null,"INC","","",0,1,1,-1,0]
[null,null,null,"",null,"","",null,"",null,null,null,"INC","","",0,1,1,-1,0]
[null,null,null,"",null,"","",null,"",null,null,null,"INC","","",0,1,1,-1,0]
[null,null,null,"",null,"","",null,"",null,null,null,"INC","","",0,1,1,-1,0]
[null,null,null,"",null,"","",null,"",null,null,null,"INC","","",0,1,1,-1,0]
[null,null,null,"",null,"","",null,"",null,null,null,"INC","","",0,1,1,-1,0]
[null,null,null,"",null,"","",null,"",null,null,null,"INC","","",0,1,1,-1,0]
[null,null,null,"",null,"","",null,"",null,null,null,"INC","","",0,1,1,-1,0]
[null,null,null,"",null,"","",null,"",null,null,null,"INC","","",0,1,1,-1,0]
[null,null,null,"",null,{"$f":"IF(ISBLANK(E718),D718,IF(J718>110,IF(E718=\"WS\",0.4,IF(E718=\"SD\",0.3)),(IF(J718>70,(IF(E718=\"WS\",0.6-(1-(110-J718)/(110-70))*(0.6-0.4),IF(E718=\"SD\",0.5-(1-(110-J718)/(110-70))*(0.5-0.3),D718))),D718))))","v":""},"",null,"",null,null,null,"INC","","",0,1,1,-1,0]
[null,null,null,{"$f":"IF(E719=\"\", \"\", IF(E719=\"C\",0.6,IF(E719=\"SD\",0.5,IF(E719=\"WS\",0.6,IF(E719=\"TF\",0.5,IF(E719=\"PF\",0.6,0.5))))))","v":""},null,"",{"$f":"IF((C719<>\"\")*AND(F719<>\"\"), C719*F719, \"\")","v":""},null,{"$f":"IF(E719=\"\", \"\", IF(E719=\"SD\",110,IF(E719=\"WS\",110,IF(E719=\"C\",110,IF(E719=\"TF\",70,IF(E719=\"PF\",85,110))))))","v":""},null,null,null,{"$f":"IF((H719<>\"\")*AND(J719<>\"\")*AND(C719<>\"\")*AND(E719<>\"\"), IF((H719<=G719)*AND(J719<=I719)*AND(P719+Q719+R719>1),\"PASS\",\"FAIL\"), \"INC\")","v":"INC"},{"$f":"IF((E719=\"C\")*AND(C719<>\"\")*AND(C719<100)*AND(H719<10),\"See Note 2) above in cell A5 & A6\",IF((E719=\"SD\")*AND(L719=\"Not Applicable\"),\"Regulated Power Supply Assumed\",\"\"))","v":""},{"$f":"IF(E719=\"WS\",0.6-(1-(110-J719)/(110-70))*(0.6-0.4),IF(E719=\"SD\",0.5-(1-(110-J719)/(110-70))*(0.5-0.3),D719))","v":""},{"$f":"IF((E719=\"SD\")*AND(K719>=1),1,IF(L719=$X$12,1,0))","v":0},{"$f":"IF(E719=\"SD\", IF((L719=$X$10)*AND(K719/H719>=0.3), 1, IF((L719=$X$11)*AND(K719/H719>=0.1), 1, IF(L719=$X$12, 1, 0))), 1)","v":1},{"$f":"IF(E719<>\"SD\",1,0)","v":1},{"$f":"IF(E719=\"SD\", IF(L719=$X$10, 0.3*H719, IF(L719=$X$11, 0.1*H719, (K719-1))), K719-1)","v":-1},{"$f":"IF(E719=\"SD\", IF(K719>=1, IF(K719>=S719, 0, 1), 1), 0)","v":0}]
[null,null,null,"",null,"","",null,"",null,null,null,"INC","","",0,1,1,-1,0]
[null,null,null,"",null,"","",null,"",null,null,null,"INC","","",0,1,1,-1,0]
[null,null,null,"",null,"","",null,"",null,null,null,"INC","","",0,1,1,-1,0]
[null,null,null,"",null,"","",null,"",null,null,null,"INC","","",0,1,1,-1,0]
[null,null,null,"",null,"","",null,"",null,null,null,"INC","","",0,1,1,-1,0]
[null,null,null,"",null,"","",null,"",null,null,null,"INC","","",0,1,1,-1,0]
[null,null,null,"",null,"","",null,"",null,null,null,"INC","","",0,1,1,-1,0]
[null,null,null,"",null,"","",null,"",null,null,null,"INC","","",0,1,1,-1,0]
[null,null,null,"",null,"","",null,"",null,null,null,"INC","","",0,1,1,-1,0]
[null,null,null,"",null,"","",null,"",null,null,null,"INC","","",0,1,1,-1,0]
[null,null,null,"",null,"","",null,"",null,null,null,"INC","","",0,1,1,-1,0]
[null,null,null,"",null,"","",null,"",null,null,null,"INC","","",0,1,1,-1,0]
[null,null,null,"",null,"","",null,"",null,null,null,"INC","","",0,1,1,-1,0]
[null,null,null,"",null,"","",null,"",null,null,null,"INC","","",0,1,1,-1,0]
[null,null,null,"",null,"","",null,"",null,null,null,"INC","","",0,1,1,-1,0]
[null,null,null,"",null,"","",null,"",null,null,null,"INC","","",0,1,1,-1,0]
[null,null,null,"",null,"","",null,"",null,null,null,"INC","","",0,1,1,-1,0]
[null,null,null,"",null,"","",null,"",null,null,null,"INC","","",0,1,1,-1,0]
[null,null,null,"",null,"","",null,"",null,null,null,"INC","","",0,1,1,-1,0]
[null,null,null,"",null,"","",null,"",null,null,null,"INC","","",0,1,1,-1,0]
[null,null,null,"",null,"","",null,"",null,null,null,"INC","","",0,1,1,-1,0]
[null,null,null,"",null,"","",null,"",null,null,null,"INC","","",0,1,1,-1,0]
[null,null,null,"",null,"","",null,"",null,null,null,"INC","","",0,1,1,-1,0]
[null,null,null,"",null,"","",null,"",null,null,null,"INC","","",0,1,1,-1,0]
[null,null,null,"",null,"","",null,"",null,null,null,"INC","","",0,1,1,-1,0]
[null,null,null,"",null,"","",null,"",null,null,null,"INC","","",0,1,1,-1,0]
[null,null,null,"",null,"","",null,"",null,null,null,"INC","","",0,1,1,-1,0]
[null,null,null,"",null,"","",null,"",null,null,null,"INC","","",0,1,1,-1,0]
[null,null,null,"",null,"","",null,"",null,null,null,"INC","","",0,1,1,-1,0]
[null,null,null,"",null,"","",null,"",null,null,null,"INC","","",0,1,1,-1,0]
[null,null,null,"",null,"","",null,"",null,null,null,"INC","","",0,1,1,-1,0]
[null,null,null,"",null,"","",null,"",null,null,null,"INC","","",0,1,1,-1,0]
[null,null,null,"",null,"","",null,"",null,null,null,"INC","","",0,1,1,-1,0]
[null,null,null,"",null,"","",null,"",null,null,null,"INC","","",0,1,1,-1,0]
[null,null,null,"",null,"","",null,"",null,null,null,"INC","","",0,1,1,-1,0]
[null,null,null,"",null,"","",null,"",null,null,null,"INC","","",0,1,1,-1,0]
[null,null,null,"",null,"","",null,"",null,null,null,"INC","","",0,1,1,-1,0]
[null,null,null,"",null,"","",null,"",null,null,null,"INC","","",0,1,1,-1,0]
[null,null,null,"",null,"","",null,"",null,null,null,"INC","","",0,1,1,-1,0]
[null,null,null,"",null,"","",null,"",null,null,null,"INC","","",0,1,1,-1,0]
[null,null,null,"",null,"","",null,"",null,null,null,"INC","","",0,1,1,-1,0]
[null,null,null,"",null,"","",null,"",null,null,null,"INC","","",0,1,1,-1,0]
[null,null,null,"",null,"","",null,"",null,null,null,"INC","","",0,1,1,-1,0]
[null,null,null,"",null,"","",null,"",null,null,null,"INC","","",0,1,1,-1,0]
[null,null,null,"",null,"","",null,"",null,null,null,"INC","","",0,1,1,-1,0]
[null,null,null,"",null,"","",null,"",null,null,null,"INC","","",0,1,1,-1,0]
[null,null,null,"",null,"","",null,"",null,null,null,"INC","","",0,1,1,-1,0]
[null,null,null,"",null,"","",null,"",null,null,null,"INC","","",0,1,1,-1,0]
[null,null,null,"",null,"","",null,"",null,null,null,"INC","","",0,1,1,-1,0]
[null,null,null,"",null,"","",null,"",null,null,null,"INC","","",0,1,1,-1,0]
[null,null,null,"",null,"","",null,"",null,null,null,"INC","","",0,1,1,-1,0]
[null,null,null,"",null,"","",null,"",null,null,null,"INC","","",0,1,1,-1,0]
[null,null,null,"",null,"","",null,"",null,null,null,"INC","","",0,1,1,-1,0]
[null,null,null,"",null,"","",null,"",null,null,null,"INC","","",0,1,1,-1,0]
[null,null,null,"",null,"","",null,"",null,null,null,"INC","","",0,1,1,-1,0]
[null,null,null,"",null,"","",null,"",null,null,null,"INC","","",0,1,1,-1,0]
[null,null,null,"",null,"","",null,"",null,null,null,"INC","","",0,1,1,-1,0]
[null,null,null,"",null,"","",null,"",null,null,null,"INC","","",0,1,1,-1,0]
[null,null,null,"",null,"","",null,"",null,null,null,"INC","","",0,1,1,-1,0]
[null,null,null,"",null,"","",null,"",null,null,null,"INC","","",0,1,1,-1,0]
[null,null,null,"",null,"","",null,"",null,null,null,"INC","","",0,1,1,-1,0]
[null,null,null,"",null,"","",null,"",null,null,null,"INC","","",0,1,1,-1,0]
[null,null,null,"",null,{"$f":"IF(ISBLANK(E782),D782,IF(J782>110,IF(E782=\"WS\",0.4,IF(E782=\"SD\",0.3)),(IF(J782>70,(IF(E782=\"WS\",0.6-(1-(110-J782)/(110-70))*(0.6-0.4),IF(E782=\"SD\",0.5-(1-(110-J782)/(110-70))*(0.5-0.3),D782))),D782))))","v":""},"",null,"",null,null,null,"INC","","",0,1,1,-1,0]
[null,null,null,{"$f":"IF(E783=\"\", \"\", IF(E783=\"C\",0.6,IF(E783=\"SD\",0.5,IF(E783=\"WS\",0.6,IF(E783=\"TF\",0.5,IF(E783=\"PF\",0.6,0.5))))))","v":""},null,"",{"$f":"IF((C783<>\"\")*AND(F783<>\"\"), C783*F783, \"\")","v":""},null,{"$f":"IF(E783=\"\", \"\", IF(E783=\"SD\",110,IF(E783=\"WS\",110,IF(E783=\"C\",110,IF(E783=\"TF\",70,IF(E783=\"PF\",85,110))))))","v":""},null,null,null,{"$f":"IF((H783<>\"\")*AND(J783<>\"\")*AND(C783<>\"\")*AND(E783<>\"\"), IF((H783<=G783)*AND(J783<=I783)*AND(P783+Q783+R783>1),\"PASS\",\"FAIL\"), \"INC\")","v":"INC"},{"$f":"IF((E783=\"C\")*AND(C783<>\"\")*AND(C783<100)*AND(H783<10),\"See Note 2) above in cell A5 & A6\",IF((E783=\"SD\")*AND(L783=\"Not Applicable\"),\"Regulated Power Supply Assumed\",\"\"))","v":""},{"$f":"IF(E783=\"WS\",0.6-(1-(110-J783)/(110-70))*(0.6-0.4),IF(E783=\"SD\",0.5-(1-(110-J783)/(110-70))*(0.5-0.3),D783))","v":""},{"$f":"IF((E783=\"SD\")*AND(K783>=1),1,IF(L783=$X$12,1,0))","v":0},{"$f":"IF(E783=\"SD\", IF((L783=$X$10)*AND(K783/H783>=0.3), 1, IF((L783=$X$11)*AND(K783/H783>=0.1), 1, IF(L783=$X$12, 1, 0))), 1)","v":1},{"$f":"IF(E783<>\"SD\",1,0)","v":1},{"$f":"IF(E783=\"SD\", IF(L783=$X$10, 0.3*H783, IF(L783=$X$11, 0.1*H783, (K783-1))), K783-1)","v":-1},{"$f":"IF(E783=\"SD\", IF(K783>=1, IF(K783>=S783, 0, 1), 1), 0)","v":0}]
[null,null,null,"",null,"","",null,"",null,null,null,"INC","","",0,1,1,-1,0]
[null,null,null,"",null,"","",null,"",null,null,null,"INC","","",0,1,1,-1,0]
[null,null,null,"",null,"","",null,"",null,null,null,"INC","","",0,1,1,-1,0]
[null,null,null,"",null,"","",null,"",null,null,null,"INC","","",0,1,1,-1,0]
[null,null,null,"",null,"","",null,"",null,null,null,"INC","","",0,1,1,-1,0]
[null,null,null,"",null,"","",null,"",null,null,null,"INC","","",0,1,1,-1,0]
[null,null,null,"",null,"","",null,"",null,null,null,"INC","","",0,1,1,-1,0]
[null,null,null,"",null,"","",null,"",null,null,null,"INC","","",0,1,1,-1,0]
[null,null,null,"",null,"","",null,"",null,null,null,"INC","","",0,1,1,-1,0]
[null,null,null,"",null,"","",null,"",null,null,null,"INC","","",0,1,1,-1,0]
[null,null,null,"",null,"","",null,"",null,null,null,"INC","","",0,1,1,-1,0]
[null,null,null,"",null,"","",null,"",null,null,null,"INC","","",0,1,1,-1,0]
[null,null,null,"",null,"","",null,"",null,null,null,"INC","","",0,1,1,-1,0]
[null,null,null,"",null,"","",null,"",null,null,null,"INC","","",0,1,1,-1,0]
[null,null,null,"",null,"","",null,"",null,null,null,"INC","","",0,1,1,-1,0]
[null,null,null,"",null,"","",null,"",null,null,null,"INC","","",0,1,1,-1,0]
[null,null,null,"",null,"","",null,"",null,null,null,"INC","","",0,1,1,-1,0]
[null,null,null,"",null,"","",null,"",null,null,null,"INC","","",0,1,1,-1,0]
[null,null,null,"",null,"","",null,"",null,null,null,"INC","","",0,1,1,-1,0]
[null,null,null,"",null,"","",null,"",null,null,null,"INC","","",0,1,1,-1,0]
[null,null,null,"",null,"","",null,"",null,null,null,"INC","","",0,1,1,-1,0]
[null,null,null,"",null,"","",null,"",null,null,null,"INC","","",0,1,1,-1,0]
[null,null,null,"",null,"","",null,"",null,null,null,"INC","","",0,1,1,-1,0]
[null,null,null,"",null,"","",null,"",null,null,null,"INC","","",0,1,1,-1,0]
[null,null,null,"",null,"","",null,"",null,null,null,"INC","","",0,1,1,-1,0]
[null,null,null,"",null,"","",null,"",null,null,null,"INC","","",0,1,1,-1,0]
[null,null,null,"",null,"","",null,"",null,null,null,"INC","","",0,1,1,-1,0]
[null,null,null,"",null,"","",null,"",null,null,null,"INC","","",0,1,1,-1,0]
[null,null,null,"",null,"","",null,"",null,null,null,"INC","","",0,1,1,-1,0]
[null,null,null,"",null,"","",null,"",null,null,null,"INC","","",0,1,1,-1,0]
[null,null,null,"",null,"","",null,"",null,null,null,"INC","","",0,1,1,-1,0]
[null,null,null,"",null,"","",null,"",null,null,null,"INC","","",0,1,1,-1,0]
[null,null,null,"",null,"","",null,"",null,null,null,"INC","","",0,1,1,-1,0]
[null,null,null,"",null,"","",null,"",null,null,null,"INC","","",0,1,1,-1,0]
[null,null,null,"",null,"","",null,"",null,null,null,"INC","","",0,1,1,-1,0]
[null,null,null,"",null,"","",null,"",null,null,null,"INC","","",0,1,1,-1,0]
[null,null,null,"",null,"","",null,"",null,null,null,"INC","","",0,1,1,-1,0]
[null,null,null,"",null,"","",null,"",null,null,null,"INC","","",0,1,1,-1,0]
[null,null,null,"",null,"","",null,"",null,null,null,"INC","","",0,1,1,-1,0]
[null,null,null,"",null,"","",null,"",null,null,null,"INC","","",0,1,1,-1,0]
[null,null,null,"",null,"","",null,"",null,null,null,"INC","","",0,1,1,-1,0]
[null,null,null,"",null,"","",null,"",null,null,null,"INC","","",0,1,1,-1,0]
[null,null,null,"",null,"","",null,"",null,null,null,"INC","","",0,1,1,-1,0]
[null,null,null,"",null,"","",null,"",null,null,null,"INC","","",0,1,1,-1,0]
[null,null,null,"",null,"","",null,"",null,null,null,"INC","","",0,1,1,-1,0]
[null,null,null,"",null,"","",null,"",null,null,null,"INC","","",0,1,1,-1,0]
[null,null,null,"",null,"","",null,"",null,null,null,"INC","","",0,1,1,-1,0]
[null,null,null,"",null,"","",null,"",null,null,null,"INC","","",0,1,1,-1,0]
[null,null,null,"",null,"","",null,"",null,null,null,"INC","","",0,1,1,-1,0]
[null,null,null,"",null,"","",null,"",null,null,null,"INC","","",0,1,1,-1,0]
[null,null,null,"",null,"","",null,"",null,null,null,"INC","","",0,1,1,-1,0]
[null,null,null,"",null,"","",null,"",null,null,null,"INC","","",0,1,1,-1,0]
[null,null,null,"",null,"","",null,"",null,null,null,"INC","","",0,1,1,-1,0]

{"sheet":"Resistors","index":8,"n_rows":1063,"n_cols":25,"rows_kept":1063,"cut":false,"hidden":false,"merged":[]}
["Resistor Derating Worksheet (reference GSFC Document EEE-INST-002, Section R2, Table 4)",null,null,null,null,null,null,null,null,"CUI//SP-EXPT"]
[null,null,null,null,null,null,null,null,null,null,null,null,null,null,null,null,null,null,null,null,"P","V","T1","T2","T3"]
["Notes:",null,null,null,null,null,null,null,null,null,null,null,null,null,null,null,null,null,null,null,0.6,0.8,25,94,110]
["    1) Compute the resistor's derated power level by multiplying its nominal power rating by the appropriate derating factor for ambient temperature <= T1. If the resistor is operated above T1, derate linearly from the T1 power",null,null,null,null,null,null,null,null,null,null,null,null,null,null,null,null,null,null,null,0.5,null,70,103,125]
["        level to the zero power level at T2. Exposing the resistor to temperatures exceeding T3, even under no load conditions, may result in permanent degradation.",null,null,null,null,null,null,null,null,null,null,null,null,null,null,null,null,null,null,null,0.35,null,85,118,145]
["    2) The maximum applied voltage shall not exceed the lesser of the following: (1) 80% of the specified maximum voltage rating, or (2) √(P*R), where: P= Derated power (Watts), R= Resistance of that portion of the element ",null,null,null,null,null,null,null,null,null,null,null,null,null,null,null,null,null,null,null,0.25,null,125,124,150]
["        actually active in the circuit. This voltage derating applies to DC and regular AC waveform applications. For pulse and other irregular waveform applications, consult the manufacturer. ",null,null,null,null,null,null,null,null,null,null,null,null,null,null,null,null,null,null,null,null,null,null,130,175]
["    3) Determine the zero power temperature (T3) from the applicable detail specification. Compute the derated zero power temperature (T2) from the formula:   T2 = DF(T3 - T1) + T1",null,null,null,null,null,null,null,null,null,null,null,null,null,null,null,null,null,null,null,null,null,null,132,225]
[null,"where:","T2 = Derated zero power temperature",null,null,"DF = Derating Factor",null,null,"T3 = Zero power temperature",null,null,null,"T1 = Rated power temperature",null,null,null,null,null,null,null,null,null,null,137,250]
["    4) Determine the rated power, the rated power temperature (T1), and the zero power temperature (T3) from the manufacturer's specification. Calculate the derated zero power temperature (T2) as per the previous note.",null,null,null,null,null,null,null,null,null,null,null,null,null,null,null,null,null,null,null,null,null,null,155]
["    5)  Duty Cycle for applied Voltage (1.0 for steady state voltage)",null,null,null,null,null,null,null,null,null,null,null,null,null,null,null,null,null,null,null,null,null,null,160]
[null,null,null,null,null,null,null,null,null,null,null,null,null,null,null,null,null,null,null,null,null,null,null,185]
[null,null,"COMPONENT SPECIFICATION SECTION",null,null,null,null,null,null,null,null,null,null,null,null,null,"DERATING SECTION"]
["Component","Ref. Des.","Resistance in Ohms","Operating Rated Power Watts","Power Derating Factor","Operating Rated Voltage","Voltage Derating Factor","GSFC Derated Operating Voltage Rqmt","Actual Ambient Temp in °C","  Operate at Power Derating Factor up to Temp. T1","Further Derate Linearly to Zero Power at Temp. T2"," Permanent Damage Even at Zero Power at Temp. T3","GSFC Derated Operating Power Rqmt","Duty Cycle  (See note 5 in Cell A11)","Actual Operating Power in Watts","Actual Operating Voltage","Pass/Fail","REMARKS"]
[null,null,null,null,null,null,null,{"$f":"IF((C15<>\"\")*AND(F15<>\"\")*AND(G15<>\"\")*AND(M15<>\"\")*AND(N15<>\"\"), IF((SQRT(M15*C15))/N15<(G15*F15),(SQRT(M15*C15))/N15,G15*F15), \"\")","v":""},null,null,null,null,{"$f":"IF((D15<>\"\")*AND(E15<>\"\")*AND(I15<>\"\")*AND(J15<>\"\")*AND(K15<>\"\"), IF((I15<J15),D15*E15,IF(D15*E15*(1-((I15-J15)/(K15-J15)))>0,D15*E15*(1-((I15-J15)/(K15-J15))),0)), \"\")","v":""},null,{"$f":"IF((C15<>\"\")*AND(N15<>\"\")*AND(P15<>\"\"), (P15^2/C15)*N15, \"\")","v":""},null,{"$f":"IF((H15<>\"\")*AND(I15<>\"\")*AND(M15<>\"\")*AND(O15<>\"\")*AND(P15<>\"\"), IF((O15<=M15)*AND(P15<=H15)*AND(I15<=K15),\"PASS\",\"FAIL\"), \"INC\")","v":"INC"}]
[null,null,null,null,null,null,null,"",null,null,null,null,"",null,"",null,"INC"]
[null,null,null,null,null,null,null,"",null,null,null,null,"",null,"",null,"INC"]
[null,null,null,null,null,null,null,"",null,null,null,null,"",null,"",null,"INC"]
[null,null,null,null,null,null,null,"",null,null,null,null,"",null,"",null,"INC"]
[null,null,null,null,null,null,null,"",null,null,null,null,"",null,"",null,"INC"]
[null,null,null,null,null,null,null,"",null,null,null,null,"",null,"",null,"INC"]
[null,null,null,null,null,null,null,"",null,null,null,null,"",null,"",null,"INC"]
[null,null,null,null,null,null,null,"",null,null,null,null,"",null,"",null,"INC"]
[null,null,null,null,null,null,null,"",null,null,null,null,"",null,"",null,"INC"]
[null,null,null,null,null,null,null,"",null,null,null,null,"",null,"",null,"INC"]
[null,null,null,null,null,null,null,"",null,null,null,null,"",null,"",null,"INC"]
[null,null,null,null,null,null,null,"",null,null,null,null,"",null,"",null,"INC"]
[null,null,null,null,null,null,null,"",null,null,null,null,"",null,"",null,"INC"]
[null,null,null,null,null,null,null,"",null,null,null,null,"",null,"",null,"INC"]
[null,null,null,null,null,null,null,"",null,null,null,null,"",null,"",null,"INC"]
[null,null,null,null,null,null,null,"",null,null,null,null,"",null,"",null,"INC"]
[null,null,null,null,null,null,null,"",null,null,null,null,"",null,"",null,"INC"]
[null,null,null,null,null,null,null,"",null,null,null,null,"",null,"",null,"INC"]
[null,null,null,null,null,null,null,"",null,null,null,null,"",null,"",null,"INC"]
[null,null,null,null,null,null,null,"",null,null,null,null,"",null,"",null,"INC"]
[null,null,null,null,null,null,null,"",null,null,null,null,"",null,"",null,"INC"]
[null,null,null,null,null,null,null,"",null,null,null,null,"",null,"",null,"INC"]
[null,null,null,null,null,null,null,"",null,null,null,null,"",null,"",null,"INC"]
[null,null,null,null,null,null,null,"",null,null,null,null,"",null,"",null,"INC"]
[null,null,null,null,null,null,null,"",null,null,null,null,"",null,"",null,"INC"]
[null,null,null,null,null,null,null,"",null,null,null,null,"",null,"",null,"INC"]
[null,null,null,null,null,null,null,"",null,null,null,null,"",null,"",null,"INC"]
[null,null,null,null,null,null,null,"",null,null,null,null,"",null,"",null,"INC"]
[null,null,null,null,null,null,null,"",null,null,null,null,"",null,"",null,"INC"]
[null,null,null,null,null,null,null,"",null,null,null,null,"",null,"",null,"INC"]
[null,null,null,null,null,null,null,"",null,null,null,null,"",null,"",null,"INC"]
[null,null,null,null,null,null,null,"",null,null,null,null,"",null,"",null,"INC"]
[null,null,null,null,null,null,null,"",null,null,null,null,"",null,"",null,"INC"]
[null,null,null,null,null,null,null,"",null,null,null,null,"",null,"",null,"INC"]
[null,null,null,null,null,null,null,"",null,null,null,null,"",null,"",null,"INC"]
[null,null,null,null,null,null,null,"",null,null,null,null,"",null,"",null,"INC"]
[null,null,null,null,null,null,null,"",null,null,null,null,"",null,"",null,"INC"]
[null,null,null,null,null,null,null,"",null,null,null,null,"",null,"",null,"INC"]
[null,null,null,null,null,null,null,"",null,null,null,null,"",null,"",null,"INC"]
[null,null,null,null,null,null,null,"",null,null,null,null,"",null,"",null,"INC"]
[null,null,null,null,null,null,null,"",null,null,null,null,"",null,"",null,"INC"]
[null,null,null,null,null,null,null,"",null,null,null,null,"",null,"",null,"INC"]
[null,null,null,null,null,null,null,"",null,null,null,null,"",null,"",null,"INC"]
[null,null,null,null,null,null,null,"",null,null,null,null,"",null,"",null,"INC"]
[null,null,null,null,null,null,null,"",null,null,null,null,"",null,"",null,"INC"]
[null,null,null,null,null,null,null,"",null,null,null,null,"",null,"",null,"INC"]
[null,null,null,null,null,null,null,"",null,null,null,null,"",null,"",null,"INC"]
[null,null,null,null,null,null,null,"",null,null,null,null,"",null,"",null,"INC"]
[null,null,null,null,null,null,null,"",null,null,null,null,"",null,"",null,"INC"]
[null,null,null,null,null,null,null,"",null,null,null,null,"",null,"",null,"INC"]
[null,null,null,null,null,null,null,"",null,null,null,null,"",null,"",null,"INC"]
[null,null,null,null,null,null,null,"",null,null,null,null,"",null,"",null,"INC"]
[null,null,null,null,null,null,null,"",null,null,null,null,"",null,"",null,"INC"]
[null,null,null,null,null,null,null,"",null,null,null,null,"",null,"",null,"INC"]
[null,null,null,null,null,null,null,"",null,null,null,null,"",null,"",null,"INC"]
[null,null,null,null,null,null,null,"",null,null,null,null,"",null,"",null,"INC"]
[null,null,null,null,null,null,null,"",null,null,null,null,"",null,"",null,"INC"]
[null,null,null,null,null,null,null,"",null,null,null,null,"",null,"",null,"INC"]
[null,null,null,null,null,null,null,"",null,null,null,null,"",null,"",null,"INC"]
[null,null,null,null,null,null,null,"",null,null,null,null,"",null,"",null,"INC"]
[null,null,null,null,null,null,null,"",null,null,null,null,"",null,"",null,"INC"]
[null,null,null,null,null,null,null,"",null,null,null,null,"",null,"",null,"INC"]
[null,null,null,null,null,null,null,"",null,null,null,null,"",null,"",null,"INC"]
[null,null,null,null,null,null,null,{"$f":"IF((C79<>\"\")*AND(F79<>\"\")*AND(G79<>\"\")*AND(M79<>\"\")*AND(N79<>\"\"), IF((SQRT(M79*C79))/N79<(G79*F79),(SQRT(M79*C79))/N79,G79*F79), \"\")","v":""},null,null,null,null,{"$f":"IF((D79<>\"\")*AND(E79<>\"\")*AND(I79<>\"\")*AND(J79<>\"\")*AND(K79<>\"\"), IF((I79<J79),D79*E79,IF(D79*E79*(1-((I79-J79)/(K79-J79)))>0,D79*E79*(1-((I79-J79)/(K79-J79))),0)), \"\")","v":""},null,{"$f":"IF((C79<>\"\")*AND(N79<>\"\")*AND(P79<>\"\"), (P79^2/C79)*N79, \"\")","v":""},null,{"$f":"IF((H79<>\"\")*AND(I79<>\"\")*AND(M79<>\"\")*AND(O79<>\"\")*AND(P79<>\"\"), IF((O79<=M79)*AND(P79<=H79)*AND(I79<=K79),\"PASS\",\"FAIL\"), \"INC\")","v":"INC"}]
[null,null,null,null,null,null,null,"",null,null,null,null,"",null,"",null,"INC"]
[null,null,null,null,null,null,null,"",null,null,null,null,"",null,"",null,"INC"]
[null,null,null,null,null,null,null,"",null,null,null,null,"",null,"",null,"INC"]
[null,null,null,null,null,null,null,"",null,null,null,null,"",null,"",null,"INC"]
[null,null,null,null,null,null,null,"",null,null,null,null,"",null,"",null,"INC"]
[null,null,null,null,null,null,null,"",null,null,null,null,"",null,"",null,"INC"]
[null,null,null,null,null,null,null,"",null,null,null,null,"",null,"",null,"INC"]
[null,null,null,null,null,null,null,"",null,null,null,null,"",null,"",null,"INC"]
[null,null,null,null,null,null,null,"",null,null,null,null,"",null,"",null,"INC"]
[null,null,null,null,null,null,null,"",null,null,null,null,"",null,"",null,"INC"]
[null,null,null,null,null,null,null,"",null,null,null,null,"",null,"",null,"INC"]
[null,null,null,null,null,null,null,"",null,null,null,null,"",null,"",null,"INC"]
[null,null,null,null,null,null,null,"",null,null,null,null,"",null,"",null,"INC"]
[null,null,null,null,null,null,null,"",null,null,null,null,"",null,"",null,"INC"]
[null,null,null,null,null,null,null,"",null,null,null,null,"",null,"",null,"INC"]
[null,null,null,null,null,null,null,"",null,null,null,null,"",null,"",null,"INC"]
[null,null,null,null,null,null,null,"",null,null,null,null,"",null,"",null,"INC"]
[null,null,null,null,null,null,null,"",null,null,null,null,"",null,"",null,"INC"]
[null,null,null,null,null,null,null,"",null,null,null,null,"",null,"",null,"INC"]
[null,null,null,null,null,null,null,"",null,null,null,null,"",null,"",null,"INC"]
[null,null,null,null,null,null,null,"",null,null,null,null,"",null,"",null,"INC"]
[null,null,null,null,null,null,null,"",null,null,null,null,"",null,"",null,"INC"]
[null,null,null,null,null,null,null,"",null,null,null,null,"",null,"",null,"INC"]
[null,null,null,null,null,null,null,"",null,null,null,null,"",null,"",null,"INC"]
[null,null,null,null,null,null,null,"",null,null,null,null,"",null,"",null,"INC"]
[null,null,null,null,null,null,null,"",null,null,null,null,"",null,"",null,"INC"]
[null,null,null,null,null,null,null,"",null,null,null,null,"",null,"",null,"INC"]
[null,null,null,null,null,null,null,"",null,null,null,null,"",null,"",null,"INC"]
[null,null,null,null,null,null,null,"",null,null,null,null,"",null,"",null,"INC"]
[null,null,null,null,null,null,null,"",null,null,null,null,"",null,"",null,"INC"]
[null,null,null,null,null,null,null,"",null,null,null,null,"",null,"",null,"INC"]
[null,null,null,null,null,null,null,"",null,null,null,null,"",null,"",null,"INC"]
[null,null,null,null,null,null,null,"",null,null,null,null,"",null,"",null,"INC"]
[null,null,null,null,null,null,null,"",null,null,null,null,"",null,"",null,"INC"]
[null,null,null,null,null,null,null,"",null,null,null,null,"",null,"",null,"INC"]
[null,null,null,null,null,null,null,"",null,null,null,null,"",null,"",null,"INC"]
[null,null,null,null,null,null,null,"",null,null,null,null,"",null,"",null,"INC"]
[null,null,null,null,null,null,null,"",null,null,null,null,"",null,"",null,"INC"]
[null,null,null,null,null,null,null,"",null,null,null,null,"",null,"",null,"INC"]
[null,null,null,null,null,null,null,"",null,null,null,null,"",null,"",null,"INC"]
[null,null,null,null,null,null,null,"",null,null,null,null,"",null,"",null,"INC"]
[null,null,null,null,null,null,null,"",null,null,null,null,"",null,"",null,"INC"]
[null,null,null,null,null,null,null,"",null,null,null,null,"",null,"",null,"INC"]
[null,null,null,null,null,null,null,"",null,null,null,null,"",null,"",null,"INC"]
[null,null,null,null,null,null,null,"",null,null,null,null,"",null,"",null,"INC"]
[null,null,null,null,null,null,null,"",null,null,null,null,"",null,"",null,"INC"]
[null,null,null,null,null,null,null,"",null,null,null,null,"",null,"",null,"INC"]
[null,null,null,null,null,null,null,"",null,null,null,null,"",null,"",null,"INC"]
[null,null,null,null,null,null,null,"",null,null,null,null,"",null,"",null,"INC"]
[null,null,null,null,null,null,null,"",null,null,null,null,"",null,"",null,"INC"]
[null,null,null,null,null,null,null,"",null,null,null,null,"",null,"",null,"INC"]
[null,null,null,null,null,null,null,"",null,null,null,null,"",null,"",null,"INC"]
[null,null,null,null,null,null,null,"",null,null,null,null,"",null,"",null,"INC"]
[null,null,null,null,null,null,null,"",null,null,null,null,"",null,"",null,"INC"]
[null,null,null,null,null,null,null,"",null,null,null,null,"",null,"",null,"INC"]
[null,null,null,null,null,null,null,"",null,null,null,null,"",null,"",null,"INC"]
[null,null,null,null,null,null,null,"",null,null,null,null,"",null,"",null,"INC"]
[null,null,null,null,null,null,null,"",null,null,null,null,"",null,"",null,"INC"]
[null,null,null,null,null,null,null,"",null,null,null,null,"",null,"",null,"INC"]
[null,null,null,null,null,null,null,"",null,null,null,null,"",null,"",null,"INC"]
[null,null,null,null,null,null,null,"",null,null,null,null,"",null,"",null,"INC"]
[null,null,null,null,null,null,null,"",null,null,null,null,"",null,"",null,"INC"]
[null,null,null,null,null,null,null,"",null,null,null,null,"",null,"",null,"INC"]
[null,null,null,null,null,null,null,{"$f":"IF((C143<>\"\")*AND(F143<>\"\")*AND(G143<>\"\")*AND(M143<>\"\")*AND(N143<>\"\"), IF((SQRT(M143*C143))/N143<(G143*F143),(SQRT(M143*C143))/N143,G143*F143), \"\")","v":""},null,null,null,null,{"$f":"IF((D143<>\"\")*AND(E143<>\"\")*AND(I143<>\"\")*AND(J143<>\"\")*AND(K143<>\"\"), IF((I143<J143),D143*E143,IF(D143*E143*(1-((I143-J143)/(K143-J143)))>0,D143*E143*(1-((I143-J143)/(K143-J143))),0)), \"\")","v":""},null,{"$f":"IF((C143<>\"\")*AND(N143<>\"\")*AND(P143<>\"\"), (P143^2/C143)*N143, \"\")","v":""},null,{"$f":"IF((H143<>\"\")*AND(I143<>\"\")*AND(M143<>\"\")*AND(O143<>\"\")*AND(P143<>\"\"), IF((O143<=M143)*AND(P143<=H143)*AND(I143<=K143),\"PASS\",\"FAIL\"), \"INC\")","v":"INC"}]
[null,null,null,null,null,null,null,"",null,null,null,null,"",null,"",null,"INC"]
[null,null,null,null,null,null,null,"",null,null,null,null,"",null,"",null,"INC"]
[null,null,null,null,null,null,null,"",null,null,null,null,"",null,"",null,"INC"]
[null,null,null,null,null,null,null,"",null,null,null,null,"",null,"",null,"INC"]
[null,null,null,null,null,null,null,"",null,null,null,null,"",null,"",null,"INC"]
[null,null,null,null,null,null,null,"",null,null,null,null,"",null,"",null,"INC"]
[null,null,null,null,null,null,null,"",null,null,null,null,"",null,"",null,"INC"]
[null,null,null,null,null,null,null,"",null,null,null,null,"",null,"",null,"INC"]
[null,null,null,null,null,null,null,"",null,null,null,null,"",null,"",null,"INC"]
[null,null,null,null,null,null,null,"",null,null,null,null,"",null,"",null,"INC"]
[null,null,null,null,null,null,null,"",null,null,null,null,"",null,"",null,"INC"]
[null,null,null,null,null,null,null,"",null,null,null,null,"",null,"",null,"INC"]
[null,null,null,null,null,null,null,"",null,null,null,null,"",null,"",null,"INC"]
[null,null,null,null,null,null,null,"",null,null,null,null,"",null,"",null,"INC"]
[null,null,null,null,null,null,null,"",null,null,null,null,"",null,"",null,"INC"]
[null,null,null,null,null,null,null,"",null,null,null,null,"",null,"",null,"INC"]
[null,null,null,null,null,null,null,"",null,null,null,null,"",null,"",null,"INC"]
[null,null,null,null,null,null,null,"",null,null,null,null,"",null,"",null,"INC"]
[null,null,null,null,null,null,null,"",null,null,null,null,"",null,"",null,"INC"]
[null,null,null,null,null,null,null,"",null,null,null,null,"",null,"",null,"INC"]
[null,null,null,null,null,null,null,"",null,null,null,null,"",null,"",null,"INC"]
[null,null,null,null,null,null,null,"",null,null,null,null,"",null,"",null,"INC"]
[null,null,null,null,null,null,null,"",null,null,null,null,"",null,"",null,"INC"]
[null,null,null,null,null,null,null,"",null,null,null,null,"",null,"",null,"INC"]
[null,null,null,null,null,null,null,"",null,null,null,null,"",null,"",null,"INC"]
[null,null,null,null,null,null,null,"",null,null,null,null,"",null,"",null,"INC"]
[null,null,null,null,null,null,null,"",null,null,null,null,"",null,"",null,"INC"]
[null,null,null,null,null,null,null,"",null,null,null,null,"",null,"",null,"INC"]
[null,null,null,null,null,null,null,"",null,null,null,null,"",null,"",null,"INC"]
[null,null,null,null,null,null,null,"",null,null,null,null,"",null,"",null,"INC"]
[null,null,null,null,null,null,null,"",null,null,null,null,"",null,"",null,"INC"]
[null,null,null,null,null,null,null,"",null,null,null,null,"",null,"",null,"INC"]
[null,null,null,null,null,null,null,"",null,null,null,null,"",null,"",null,"INC"]
[null,null,null,null,null,null,null,"",null,null,null,null,"",null,"",null,"INC"]
[null,null,null,null,null,null,null,"",null,null,null,null,"",null,"",null,"INC"]
[null,null,null,null,null,null,null,"",null,null,null,null,"",null,"",null,"INC"]
[null,null,null,null,null,null,null,"",null,null,null,null,"",null,"",null,"INC"]
[null,null,null,null,null,null,null,"",null,null,null,null,"",null,"",null,"INC"]
[null,null,null,null,null,null,null,"",null,null,null,null,"",null,"",null,"INC"]
[null,null,null,null,null,null,null,"",null,null,null,null,"",null,"",null,"INC"]
[null,null,null,null,null,null,null,"",null,null,null,null,"",null,"",null,"INC"]
[null,null,null,null,null,null,null,"",null,null,null,null,"",null,"",null,"INC"]
[null,null,null,null,null,null,null,"",null,null,null,null,"",null,"",null,"INC"]
[null,null,null,null,null,null,null,"",null,null,null,null,"",null,"",null,"INC"]
[null,null,null,null,null,null,null,"",null,null,null,null,"",null,"",null,"INC"]
[null,null,null,null,null,null,null,"",null,null,null,null,"",null,"",null,"INC"]
[null,null,null,null,null,null,null,"",null,null,null,null,"",null,"",null,"INC"]
[null,null,null,null,null,null,null,"",null,null,null,null,"",null,"",null,"INC"]
[null,null,null,null,null,null,null,"",null,null,null,null,"",null,"",null,"INC"]
[null,null,null,null,null,null,null,"",null,null,null,null,"",null,"",null,"INC"]
[null,null,null,null,null,null,null,"",null,null,null,null,"",null,"",null,"INC"]
[null,null,null,null,null,null,null,"",null,null,null,null,"",null,"",null,"INC"]
[null,null,null,null,null,null,null,"",null,null,null,null,"",null,"",null,"INC"]
[null,null,null,null,null,null,null,"",null,null,null,null,"",null,"",null,"INC"]
[null,null,null,null,null,null,null,"",null,null,null,null,"",null,"",null,"INC"]
[null,null,null,null,null,null,null,"",null,null,null,null,"",null,"",null,"INC"]
[null,null,null,null,null,null,null,"",null,null,null,null,"",null,"",null,"INC"]
[null,null,null,null,null,null,null,"",null,null,null,null,"",null,"",null,"INC"]
[null,null,null,null,null,null,null,"",null,null,null,null,"",null,"",null,"INC"]
[null,null,null,null,null,null,null,"",null,null,null,null,"",null,"",null,"INC"]
[null,null,null,null,null,null,null,"",null,null,null,null,"",null,"",null,"INC"]
[null,null,null,null,null,null,null,"",null,null,null,null,"",null,"",null,"INC"]
[null,null,null,null,null,null,null,"",null,null,null,null,"",null,"",null,"INC"]
[null,null,null,null,null,null,null,{"$f":"IF((C207<>\"\")*AND(F207<>\"\")*AND(G207<>\"\")*AND(M207<>\"\")*AND(N207<>\"\"), IF((SQRT(M207*C207))/N207<(G207*F207),(SQRT(M207*C207))/N207,G207*F207), \"\")","v":""},null,null,null,null,{"$f":"IF((D207<>\"\")*AND(E207<>\"\")*AND(I207<>\"\")*AND(J207<>\"\")*AND(K207<>\"\"), IF((I207<J207),D207*E207,IF(D207*E207*(1-((I207-J207)/(K207-J207)))>0,D207*E207*(1-((I207-J207)/(K207-J207))),0)), \"\")","v":""},null,{"$f":"IF((C207<>\"\")*AND(N207<>\"\")*AND(P207<>\"\"), (P207^2/C207)*N207, \"\")","v":""},null,{"$f":"IF((H207<>\"\")*AND(I207<>\"\")*AND(M207<>\"\")*AND(O207<>\"\")*AND(P207<>\"\"), IF((O207<=M207)*AND(P207<=H207)*AND(I207<=K207),\"PASS\",\"FAIL\"), \"INC\")","v":"INC"}]
[null,null,null,null,null,null,null,"",null,null,null,null,"",null,"",null,"INC"]
[null,null,null,null,null,null,null,"",null,null,null,null,"",null,"",null,"INC"]
[null,null,null,null,null,null,null,"",null,null,null,null,"",null,"",null,"INC"]
[null,null,null,null,null,null,null,"",null,null,null,null,"",null,"",null,"INC"]
[null,null,null,null,null,null,null,"",null,null,null,null,"",null,"",null,"INC"]
[null,null,null,null,null,null,null,"",null,null,null,null,"",null,"",null,"INC"]
[null,null,null,null,null,null,null,"",null,null,null,null,"",null,"",null,"INC"]
[null,null,null,null,null,null,null,"",null,null,null,null,"",null,"",null,"INC"]
[null,null,null,null,null,null,null,"",null,null,null,null,"",null,"",null,"INC"]
[null,null,null,null,null,null,null,"",null,null,null,null,"",null,"",null,"INC"]
[null,null,null,null,null,null,null,"",null,null,null,null,"",null,"",null,"INC"]
[null,null,null,null,null,null,null,"",null,null,null,null,"",null,"",null,"INC"]
[null,null,null,null,null,null,null,"",null,null,null,null,"",null,"",null,"INC"]
[null,null,null,null,null,null,null,"",null,null,null,null,"",null,"",null,"INC"]
[null,null,null,null,null,null,null,"",null,null,null,null,"",null,"",null,"INC"]
[null,null,null,null,null,null,null,"",null,null,null,null,"",null,"",null,"INC"]
[null,null,null,null,null,null,null,"",null,null,null,null,"",null,"",null,"INC"]
[null,null,null,null,null,null,null,"",null,null,null,null,"",null,"",null,"INC"]
[null,null,null,null,null,null,null,"",null,null,null,null,"",null,"",null,"INC"]
[null,null,null,null,null,null,null,"",null,null,null,null,"",null,"",null,"INC"]
[null,null,null,null,null,null,null,"",null,null,null,null,"",null,"",null,"INC"]
[null,null,null,null,null,null,null,"",null,null,null,null,"",null,"",null,"INC"]
[null,null,null,null,null,null,null,"",null,null,null,null,"",null,"",null,"INC"]
[null,null,null,null,null,null,null,"",null,null,null,null,"",null,"",null,"INC"]
[null,null,null,null,null,null,null,"",null,null,null,null,"",null,"",null,"INC"]
[null,null,null,null,null,null,null,"",null,null,null,null,"",null,"",null,"INC"]
[null,null,null,null,null,null,null,"",null,null,null,null,"",null,"",null,"INC"]
[null,null,null,null,null,null,null,"",null,null,null,null,"",null,"",null,"INC"]
[null,null,null,null,null,null,null,"",null,null,null,null,"",null,"",null,"INC"]
[null,null,null,null,null,null,null,"",null,null,null,null,"",null,"",null,"INC"]
[null,null,null,null,null,null,null,"",null,null,null,null,"",null,"",null,"INC"]
[null,null,null,null,null,null,null,"",null,null,null,null,"",null,"",null,"INC"]
[null,null,null,null,null,null,null,"",null,null,null,null,"",null,"",null,"INC"]
[null,null,null,null,null,null,null,"",null,null,null,null,"",null,"",null,"INC"]
[null,null,null,null,null,null,null,"",null,null,null,null,"",null,"",null,"INC"]
[null,null,null,null,null,null,null,"",null,null,null,null,"",null,"",null,"INC"]
[null,null,null,null,null,null,null,"",null,null,null,null,"",null,"",null,"INC"]
[null,null,null,null,null,null,null,"",null,null,null,null,"",null,"",null,"INC"]
[null,null,null,null,null,null,null,"",null,null,null,null,"",null,"",null,"INC"]
[null,null,null,null,null,null,null,"",null,null,null,null,"",null,"",null,"INC"]
[null,null,null,null,null,null,null,"",null,null,null,null,"",null,"",null,"INC"]
[null,null,null,null,null,null,null,"",null,null,null,null,"",null,"",null,"INC"]
[null,null,null,null,null,null,null,"",null,null,null,null,"",null,"",null,"INC"]
[null,null,null,null,null,null,null,"",null,null,null,null,"",null,"",null,"INC"]
[null,null,null,null,null,null,null,"",null,null,null,null,"",null,"",null,"INC"]
[null,null,null,null,null,null,null,"",null,null,null,null,"",null,"",null,"INC"]
[null,null,null,null,null,null,null,"",null,null,null,null,"",null,"",null,"INC"]
[null,null,null,null,null,null,null,"",null,null,null,null,"",null,"",null,"INC"]
[null,null,null,null,null,null,null,"",null,null,null,null,"",null,"",null,"INC"]
[null,null,null,null,null,null,null,"",null,null,null,null,"",null,"",null,"INC"]
[null,null,null,null,null,null,null,"",null,null,null,null,"",null,"",null,"INC"]
[null,null,null,null,null,null,null,"",null,null,null,null,"",null,"",null,"INC"]
[null,null,null,null,null,null,null,"",null,null,null,null,"",null,"",null,"INC"]
[null,null,null,null,null,null,null,"",null,null,null,null,"",null,"",null,"INC"]
[null,null,null,null,null,null,null,"",null,null,null,null,"",null,"",null,"INC"]
[null,null,null,null,null,null,null,"",null,null,null,null,"",null,"",null,"INC"]
[null,null,null,null,null,null,null,"",null,null,null,null,"",null,"",null,"INC"]
[null,null,null,null,null,null,null,"",null,null,null,null,"",null,"",null,"INC"]
[null,null,null,null,null,null,null,"",null,null,null,null,"",null,"",null,"INC"]
[null,null,null,null,null,null,null,"",null,null,null,null,"",null,"",null,"INC"]
[null,null,null,null,null,null,null,"",null,null,null,null,"",null,"",null,"INC"]
[null,null,null,null,null,null,null,"",null,null,null,null,"",null,"",null,"INC"]
[null,null,null,null,null,null,null,"",null,null,null,null,"",null,"",null,"INC"]
[null,null,null,null,null,null,null,{"$f":"IF((C271<>\"\")*AND(F271<>\"\")*AND(G271<>\"\")*AND(M271<>\"\")*AND(N271<>\"\"), IF((SQRT(M271*C271))/N271<(G271*F271),(SQRT(M271*C271))/N271,G271*F271), \"\")","v":""},null,null,null,null,{"$f":"IF((D271<>\"\")*AND(E271<>\"\")*AND(I271<>\"\")*AND(J271<>\"\")*AND(K271<>\"\"), IF((I271<J271),D271*E271,IF(D271*E271*(1-((I271-J271)/(K271-J271)))>0,D271*E271*(1-((I271-J271)/(K271-J271))),0)), \"\")","v":""},null,{"$f":"IF((C271<>\"\")*AND(N271<>\"\")*AND(P271<>\"\"), (P271^2/C271)*N271, \"\")","v":""},null,{"$f":"IF((H271<>\"\")*AND(I271<>\"\")*AND(M271<>\"\")*AND(O271<>\"\")*AND(P271<>\"\"), IF((O271<=M271)*AND(P271<=H271)*AND(I271<=K271),\"PASS\",\"FAIL\"), \"INC\")","v":"INC"}]
[null,null,null,null,null,null,null,"",null,null,null,null,"",null,"",null,"INC"]
[null,null,null,null,null,null,null,"",null,null,null,null,"",null,"",null,"INC"]
[null,null,null,null,null,null,null,"",null,null,null,null,"",null,"",null,"INC"]
[null,null,null,null,null,null,null,"",null,null,null,null,"",null,"",null,"INC"]
[null,null,null,null,null,null,null,"",null,null,null,null,"",null,"",null,"INC"]
[null,null,null,null,null,null,null,"",null,null,null,null,"",null,"",null,"INC"]
[null,null,null,null,null,null,null,"",null,null,null,null,"",null,"",null,"INC"]
[null,null,null,null,null,null,null,"",null,null,null,null,"",null,"",null,"INC"]
[null,null,null,null,null,null,null,"",null,null,null,null,"",null,"",null,"INC"]
[null,null,null,null,null,null,null,"",null,null,null,null,"",null,"",null,"INC"]
[null,null,null,null,null,null,null,"",null,null,null,null,"",null,"",null,"INC"]
[null,null,null,null,null,null,null,"",null,null,null,null,"",null,"",null,"INC"]
[null,null,null,null,null,null,null,"",null,null,null,null,"",null,"",null,"INC"]
[null,null,null,null,null,null,null,"",null,null,null,null,"",null,"",null,"INC"]
[null,null,null,null,null,null,null,"",null,null,null,null,"",null,"",null,"INC"]
[null,null,null,null,null,null,null,"",null,null,null,null,"",null,"",null,"INC"]
[null,null,null,null,null,null,null,"",null,null,null,null,"",null,"",null,"INC"]
[null,null,null,null,null,null,null,"",null,null,null,null,"",null,"",null,"INC"]
[null,null,null,null,null,null,null,"",null,null,null,null,"",null,"",null,"INC"]
[null,null,null,null,null,null,null,"",null,null,null,null,"",null,"",null,"INC"]
[null,null,null,null,null,null,null,"",null,null,null,null,"",null,"",null,"INC"]
[null,null,null,null,null,null,null,"",null,null,null,null,"",null,"",null,"INC"]
[null,null,null,null,null,null,null,"",null,null,null,null,"",null,"",null,"INC"]
[null,null,null,null,null,null,null,"",null,null,null,null,"",null,"",null,"INC"]
[null,null,null,null,null,null,null,"",null,null,null,null,"",null,"",null,"INC"]
[null,null,null,null,null,null,null,"",null,null,null,null,"",null,"",null,"INC"]
[null,null,null,null,null,null,null,"",null,null,null,null,"",null,"",null,"INC"]
[null,null,null,null,null,null,null,"",null,null,null,null,"",null,"",null,"INC"]
[null,null,null,null,null,null,null,"",null,null,null,null,"",null,"",null,"INC"]
[null,null,null,null,null,null,null,"",null,null,null,null,"",null,"",null,"INC"]
[null,null,null,null,null,null,null,"",null,null,null,null,"",null,"",null,"INC"]
[null,null,null,null,null,null,null,"",null,null,null,null,"",null,"",null,"INC"]
[null,null,null,null,null,null,null,"",null,null,null,null,"",null,"",null,"INC"]
[null,null,null,null,null,null,null,"",null,null,null,null,"",null,"",null,"INC"]
[null,null,null,null,null,null,null,"",null,null,null,null,"",null,"",null,"INC"]
[null,null,null,null,null,null,null,"",null,null,null,null,"",null,"",null,"INC"]
[null,null,null,null,null,null,null,"",null,null,null,null,"",null,"",null,"INC"]
[null,null,null,null,null,null,null,"",null,null,null,null,"",null,"",null,"INC"]
[null,null,null,null,null,null,null,"",null,null,null,null,"",null,"",null,"INC"]
[null,null,null,null,null,null,null,"",null,null,null,null,"",null,"",null,"INC"]
[null,null,null,null,null,null,null,"",null,null,null,null,"",null,"",null,"INC"]
[null,null,null,null,null,null,null,"",null,null,null,null,"",null,"",null,"INC"]
[null,null,null,null,null,null,null,"",null,null,null,null,"",null,"",null,"INC"]
[null,null,null,null,null,null,null,"",null,null,null,null,"",null,"",null,"INC"]
[null,null,null,null,null,null,null,"",null,null,null,null,"",null,"",null,"INC"]
[null,null,null,null,null,null,null,"",null,null,null,null,"",null,"",null,"INC"]
[null,null,null,null,null,null,null,"",null,null,null,null,"",null,"",null,"INC"]
[null,null,null,null,null,null,null,"",null,null,null,null,"",null,"",null,"INC"]
[null,null,null,null,null,null,null,"",null,null,null,null,"",null,"",null,"INC"]
[null,null,null,null,null,null,null,"",null,null,null,null,"",null,"",null,"INC"]
[null,null,null,null,null,null,null,"",null,null,null,null,"",null,"",null,"INC"]
[null,null,null,null,null,null,null,"",null,null,null,null,"",null,"",null,"INC"]
[null,null,null,null,null,null,null,"",null,null,null,null,"",null,"",null,"INC"]
[null,null,null,null,null,null,null,"",null,null,null,null,"",null,"",null,"INC"]
[null,null,null,null,null,null,null,"",null,null,null,null,"",null,"",null,"INC"]
[null,null,null,null,null,null,null,"",null,null,null,null,"",null,"",null,"INC"]
[null,null,null,null,null,null,null,"",null,null,null,null,"",null,"",null,"INC"]
[null,null,null,null,null,null,null,"",null,null,null,null,"",null,"",null,"INC"]
[null,null,null,null,null,null,null,"",null,null,null,null,"",null,"",null,"INC"]
[null,null,null,null,null,null,null,"",null,null,null,null,"",null,"",null,"INC"]
[null,null,null,null,null,null,null,"",null,null,null,null,"",null,"",null,"INC"]
[null,null,null,null,null,null,null,"",null,null,null,null,"",null,"",null,"INC"]
[null,null,null,null,null,null,null,"",null,null,null,null,"",null,"",null,"INC"]
[null,null,null,null,null,null,null,{"$f":"IF((C335<>\"\")*AND(F335<>\"\")*AND(G335<>\"\")*AND(M335<>\"\")*AND(N335<>\"\"), IF((SQRT(M335*C335))/N335<(G335*F335),(SQRT(M335*C335))/N335,G335*F335), \"\")","v":""},null,null,null,null,{"$f":"IF((D335<>\"\")*AND(E335<>\"\")*AND(I335<>\"\")*AND(J335<>\"\")*AND(K335<>\"\"), IF((I335<J335),D335*E335,IF(D335*E335*(1-((I335-J335)/(K335-J335)))>0,D335*E335*(1-((I335-J335)/(K335-J335))),0)), \"\")","v":""},null,{"$f":"IF((C335<>\"\")*AND(N335<>\"\")*AND(P335<>\"\"), (P335^2/C335)*N335, \"\")","v":""},null,{"$f":"IF((H335<>\"\")*AND(I335<>\"\")*AND(M335<>\"\")*AND(O335<>\"\")*AND(P335<>\"\"), IF((O335<=M335)*AND(P335<=H335)*AND(I335<=K335),\"PASS\",\"FAIL\"), \"INC\")","v":"INC"}]
[null,null,null,null,null,null,null,"",null,null,null,null,"",null,"",null,"INC"]
[null,null,null,null,null,null,null,"",null,null,null,null,"",null,"",null,"INC"]
[null,null,null,null,null,null,null,"",null,null,null,null,"",null,"",null,"INC"]
[null,null,null,null,null,null,null,"",null,null,null,null,"",null,"",null,"INC"]
[null,null,null,null,null,null,null,"",null,null,null,null,"",null,"",null,"INC"]
[null,null,null,null,null,null,null,"",null,null,null,null,"",null,"",null,"INC"]
[null,null,null,null,null,null,null,"",null,null,null,null,"",null,"",null,"INC"]
[null,null,null,null,null,null,null,"",null,null,null,null,"",null,"",null,"INC"]
[null,null,null,null,null,null,null,"",null,null,null,null,"",null,"",null,"INC"]
[null,null,null,null,null,null,null,"",null,null,null,null,"",null,"",null,"INC"]
[null,null,null,null,null,null,null,"",null,null,null,null,"",null,"",null,"INC"]
[null,null,null,null,null,null,null,"",null,null,null,null,"",null,"",null,"INC"]
[null,null,null,null,null,null,null,"",null,null,null,null,"",null,"",null,"INC"]
[null,null,null,null,null,null,null,"",null,null,null,null,"",null,"",null,"INC"]
[null,null,null,null,null,null,null,"",null,null,null,null,"",null,"",null,"INC"]
[null,null,null,null,null,null,null,"",null,null,null,null,"",null,"",null,"INC"]
[null,null,null,null,null,null,null,"",null,null,null,null,"",null,"",null,"INC"]
[null,null,null,null,null,null,null,"",null,null,null,null,"",null,"",null,"INC"]
[null,null,null,null,null,null,null,"",null,null,null,null,"",null,"",null,"INC"]
[null,null,null,null,null,null,null,"",null,null,null,null,"",null,"",null,"INC"]
[null,null,null,null,null,null,null,"",null,null,null,null,"",null,"",null,"INC"]
[null,null,null,null,null,null,null,"",null,null,null,null,"",null,"",null,"INC"]
[null,null,null,null,null,null,null,"",null,null,null,null,"",null,"",null,"INC"]
[null,null,null,null,null,null,null,"",null,null,null,null,"",null,"",null,"INC"]
[null,null,null,null,null,null,null,"",null,null,null,null,"",null,"",null,"INC"]
[null,null,null,null,null,null,null,"",null,null,null,null,"",null,"",null,"INC"]
[null,null,null,null,null,null,null,"",null,null,null,null,"",null,"",null,"INC"]
[null,null,null,null,null,null,null,"",null,null,null,null,"",null,"",null,"INC"]
[null,null,null,null,null,null,null,"",null,null,null,null,"",null,"",null,"INC"]
[null,null,null,null,null,null,null,"",null,null,null,null,"",null,"",null,"INC"]
[null,null,null,null,null,null,null,"",null,null,null,null,"",null,"",null,"INC"]
[null,null,null,null,null,null,null,"",null,null,null,null,"",null,"",null,"INC"]
[null,null,null,null,null,null,null,"",null,null,null,null,"",null,"",null,"INC"]
[null,null,null,null,null,null,null,"",null,null,null,null,"",null,"",null,"INC"]
[null,null,null,null,null,null,null,"",null,null,null,null,"",null,"",null,"INC"]
[null,null,null,null,null,null,null,"",null,null,null,null,"",null,"",null,"INC"]
[null,null,null,null,null,null,null,"",null,null,null,null,"",null,"",null,"INC"]
[null,null,null,null,null,null,null,"",null,null,null,null,"",null,"",null,"INC"]
[null,null,null,null,null,null,null,"",null,null,null,null,"",null,"",null,"INC"]
[null,null,null,null,null,null,null,"",null,null,null,null,"",null,"",null,"INC"]
[null,null,null,null,null,null,null,"",null,null,null,null,"",null,"",null,"INC"]
[null,null,null,null,null,null,null,"",null,null,null,null,"",null,"",null,"INC"]
[null,null,null,null,null,null,null,"",null,null,null,null,"",null,"",null,"INC"]
[null,null,null,null,null,null,null,"",null,null,null,null,"",null,"",null,"INC"]
[null,null,null,null,null,null,null,"",null,null,null,null,"",null,"",null,"INC"]
[null,null,null,null,null,null,null,"",null,null,null,null,"",null,"",null,"INC"]
[null,null,null,null,null,null,null,"",null,null,null,null,"",null,"",null,"INC"]
[null,null,null,null,null,null,null,"",null,null,null,null,"",null,"",null,"INC"]
[null,null,null,null,null,null,null,"",null,null,null,null,"",null,"",null,"INC"]
[null,null,null,null,null,null,null,"",null,null,null,null,"",null,"",null,"INC"]
[null,null,null,null,null,null,null,"",null,null,null,null,"",null,"",null,"INC"]
[null,null,null,null,null,null,null,"",null,null,null,null,"",null,"",null,"INC"]
[null,null,null,null,null,null,null,"",null,null,null,null,"",null,"",null,"INC"]
[null,null,null,null,null,null,null,"",null,null,null,null,"",null,"",null,"INC"]
[null,null,null,null,null,null,null,"",null,null,null,null,"",null,"",null,"INC"]
[null,null,null,null,null,null,null,"",null,null,null,null,"",null,"",null,"INC"]
[null,null,null,null,null,null,null,"",null,null,null,null,"",null,"",null,"INC"]
[null,null,null,null,null,null,null,"",null,null,null,null,"",null,"",null,"INC"]
[null,null,null,null,null,null,null,"",null,null,null,null,"",null,"",null,"INC"]
[null,null,null,null,null,null,null,"",null,null,null,null,"",null,"",null,"INC"]
[null,null,null,null,null,null,null,"",null,null,null,null,"",null,"",null,"INC"]
[null,null,null,null,null,null,null,"",null,null,null,null,"",null,"",null,"INC"]
[null,null,null,null,null,null,null,"",null,null,null,null,"",null,"",null,"INC"]
[null,null,null,null,null,null,null,{"$f":"IF((C399<>\"\")*AND(F399<>\"\")*AND(G399<>\"\")*AND(M399<>\"\")*AND(N399<>\"\"), IF((SQRT(M399*C399))/N399<(G399*F399),(SQRT(M399*C399))/N399,G399*F399), \"\")","v":""},null,null,null,null,{"$f":"IF((D399<>\"\")*AND(E399<>\"\")*AND(I399<>\"\")*AND(J399<>\"\")*AND(K399<>\"\"), IF((I399<J399),D399*E399,IF(D399*E399*(1-((I399-J399)/(K399-J399)))>0,D399*E399*(1-((I399-J399)/(K399-J399))),0)), \"\")","v":""},null,{"$f":"IF((C399<>\"\")*AND(N399<>\"\")*AND(P399<>\"\"), (P399^2/C399)*N399, \"\")","v":""},null,{"$f":"IF((H399<>\"\")*AND(I399<>\"\")*AND(M399<>\"\")*AND(O399<>\"\")*AND(P399<>\"\"), IF((O399<=M399)*AND(P399<=H399)*AND(I399<=K399),\"PASS\",\"FAIL\"), \"INC\")","v":"INC"}]
[null,null,null,null,null,null,null,"",null,null,null,null,"",null,"",null,"INC"]
[null,null,null,null,null,null,null,"",null,null,null,null,"",null,"",null,"INC"]
[null,null,null,null,null,null,null,"",null,null,null,null,"",null,"",null,"INC"]
[null,null,null,null,null,null,null,"",null,null,null,null,"",null,"",null,"INC"]
[null,null,null,null,null,null,null,"",null,null,null,null,"",null,"",null,"INC"]
[null,null,null,null,null,null,null,"",null,null,null,null,"",null,"",null,"INC"]
[null,null,null,null,null,null,null,"",null,null,null,null,"",null,"",null,"INC"]
[null,null,null,null,null,null,null,"",null,null,null,null,"",null,"",null,"INC"]
[null,null,null,null,null,null,null,"",null,null,null,null,"",null,"",null,"INC"]
[null,null,null,null,null,null,null,"",null,null,null,null,"",null,"",null,"INC"]
[null,null,null,null,null,null,null,"",null,null,null,null,"",null,"",null,"INC"]
[null,null,null,null,null,null,null,"",null,null,null,null,"",null,"",null,"INC"]
[null,null,null,null,null,null,null,"",null,null,null,null,"",null,"",null,"INC"]
[null,null,null,null,null,null,null,"",null,null,null,null,"",null,"",null,"INC"]
[null,null,null,null,null,null,null,"",null,null,null,null,"",null,"",null,"INC"]
[null,null,null,null,null,null,null,"",null,null,null,null,"",null,"",null,"INC"]
[null,null,null,null,null,null,null,"",null,null,null,null,"",null,"",null,"INC"]
[null,null,null,null,null,null,null,"",null,null,null,null,"",null,"",null,"INC"]
[null,null,null,null,null,null,null,"",null,null,null,null,"",null,"",null,"INC"]
[null,null,null,null,null,null,null,"",null,null,null,null,"",null,"",null,"INC"]
[null,null,null,null,null,null,null,"",null,null,null,null,"",null,"",null,"INC"]
[null,null,null,null,null,null,null,"",null,null,null,null,"",null,"",null,"INC"]
[null,null,null,null,null,null,null,"",null,null,null,null,"",null,"",null,"INC"]
[null,null,null,null,null,null,null,"",null,null,null,null,"",null,"",null,"INC"]
[null,null,null,null,null,null,null,"",null,null,null,null,"",null,"",null,"INC"]
[null,null,null,null,null,null,null,"",null,null,null,null,"",null,"",null,"INC"]
[null,null,null,null,null,null,null,"",null,null,null,null,"",null,"",null,"INC"]
[null,null,null,null,null,null,null,"",null,null,null,null,"",null,"",null,"INC"]
[null,null,null,null,null,null,null,"",null,null,null,null,"",null,"",null,"INC"]
[null,null,null,null,null,null,null,"",null,null,null,null,"",null,"",null,"INC"]
[null,null,null,null,null,null,null,"",null,null,null,null,"",null,"",null,"INC"]
[null,null,null,null,null,null,null,"",null,null,null,null,"",null,"",null,"INC"]
[null,null,null,null,null,null,null,"",null,null,null,null,"",null,"",null,"INC"]
[null,null,null,null,null,null,null,"",null,null,null,null,"",null,"",null,"INC"]
[null,null,null,null,null,null,null,"",null,null,null,null,"",null,"",null,"INC"]
[null,null,null,null,null,null,null,"",null,null,null,null,"",null,"",null,"INC"]
[null,null,null,null,null,null,null,"",null,null,null,null,"",null,"",null,"INC"]
[null,null,null,null,null,null,null,"",null,null,null,null,"",null,"",null,"INC"]
[null,null,null,null,null,null,null,"",null,null,null,null,"",null,"",null,"INC"]
[null,null,null,null,null,null,null,"",null,null,null,null,"",null,"",null,"INC"]
[null,null,null,null,null,null,null,"",null,null,null,null,"",null,"",null,"INC"]
[null,null,null,null,null,null,null,"",null,null,null,null,"",null,"",null,"INC"]
[null,null,null,null,null,null,null,"",null,null,null,null,"",null,"",null,"INC"]
[null,null,null,null,null,null,null,"",null,null,null,null,"",null,"",null,"INC"]
[null,null,null,null,null,null,null,"",null,null,null,null,"",null,"",null,"INC"]
[null,null,null,null,null,null,null,"",null,null,null,null,"",null,"",null,"INC"]
[null,null,null,null,null,null,null,"",null,null,null,null,"",null,"",null,"INC"]
[null,null,null,null,null,null,null,"",null,null,null,null,"",null,"",null,"INC"]
[null,null,null,null,null,null,null,"",null,null,null,null,"",null,"",null,"INC"]
[null,null,null,null,null,null,null,"",null,null,null,null,"",null,"",null,"INC"]
[null,null,null,null,null,null,null,"",null,null,null,null,"",null,"",null,"INC"]
[null,null,null,null,null,null,null,"",null,null,null,null,"",null,"",null,"INC"]
[null,null,null,null,null,null,null,"",null,null,null,null,"",null,"",null,"INC"]
[null,null,null,null,null,null,null,"",null,null,null,null,"",null,"",null,"INC"]
[null,null,null,null,null,null,null,"",null,null,null,null,"",null,"",null,"INC"]
[null,null,null,null,null,null,null,"",null,null,null,null,"",null,"",null,"INC"]
[null,null,null,null,null,null,null,"",null,null,null,null,"",null,"",null,"INC"]
[null,null,null,null,null,null,null,"",null,null,null,null,"",null,"",null,"INC"]
[null,null,null,null,null,null,null,"",null,null,null,null,"",null,"",null,"INC"]
[null,null,null,null,null,null,null,"",null,null,null,null,"",null,"",null,"INC"]
[null,null,null,null,null,null,null,"",null,null,null,null,"",null,"",null,"INC"]
[null,null,null,null,null,null,null,"",null,null,null,null,"",null,"",null,"INC"]
[null,null,null,null,null,null,null,"",null,null,null,null,"",null,"",null,"INC"]
[null,null,null,null,null,null,null,{"$f":"IF((C463<>\"\")*AND(F463<>\"\")*AND(G463<>\"\")*AND(M463<>\"\")*AND(N463<>\"\"), IF((SQRT(M463*C463))/N463<(G463*F463),(SQRT(M463*C463))/N463,G463*F463), \"\")","v":""},null,null,null,null,{"$f":"IF((D463<>\"\")*AND(E463<>\"\")*AND(I463<>\"\")*AND(J463<>\"\")*AND(K463<>\"\"), IF((I463<J463),D463*E463,IF(D463*E463*(1-((I463-J463)/(K463-J463)))>0,D463*E463*(1-((I463-J463)/(K463-J463))),0)), \"\")","v":""},null,{"$f":"IF((C463<>\"\")*AND(N463<>\"\")*AND(P463<>\"\"), (P463^2/C463)*N463, \"\")","v":""},null,{"$f":"IF((H463<>\"\")*AND(I463<>\"\")*AND(M463<>\"\")*AND(O463<>\"\")*AND(P463<>\"\"), IF((O463<=M463)*AND(P463<=H463)*AND(I463<=K463),\"PASS\",\"FAIL\"), \"INC\")","v":"INC"}]
[null,null,null,null,null,null,null,"",null,null,null,null,"",null,"",null,"INC"]
[null,null,null,null,null,null,null,"",null,null,null,null,"",null,"",null,"INC"]
[null,null,null,null,null,null,null,"",null,null,null,null,"",null,"",null,"INC"]
[null,null,null,null,null,null,null,"",null,null,null,null,"",null,"",null,"INC"]
[null,null,null,null,null,null,null,"",null,null,null,null,"",null,"",null,"INC"]
[null,null,null,null,null,null,null,"",null,null,null,null,"",null,"",null,"INC"]
[null,null,null,null,null,null,null,"",null,null,null,null,"",null,"",null,"INC"]
[null,null,null,null,null,null,null,"",null,null,null,null,"",null,"",null,"INC"]
[null,null,null,null,null,null,null,"",null,null,null,null,"",null,"",null,"INC"]
[null,null,null,null,null,null,null,"",null,null,null,null,"",null,"",null,"INC"]
[null,null,null,null,null,null,null,"",null,null,null,null,"",null,"",null,"INC"]
[null,null,null,null,null,null,null,"",null,null,null,null,"",null,"",null,"INC"]
[null,null,null,null,null,null,null,"",null,null,null,null,"",null,"",null,"INC"]
[null,null,null,null,null,null,null,"",null,null,null,null,"",null,"",null,"INC"]
[null,null,null,null,null,null,null,"",null,null,null,null,"",null,"",null,"INC"]
[null,null,null,null,null,null,null,"",null,null,null,null,"",null,"",null,"INC"]
[null,null,null,null,null,null,null,"",null,null,null,null,"",null,"",null,"INC"]
[null,null,null,null,null,null,null,"",null,null,null,null,"",null,"",null,"INC"]
[null,null,null,null,null,null,null,"",null,null,null,null,"",null,"",null,"INC"]
[null,null,null,null,null,null,null,"",null,null,null,null,"",null,"",null,"INC"]
[null,null,null,null,null,null,null,"",null,null,null,null,"",null,"",null,"INC"]
[null,null,null,null,null,null,null,"",null,null,null,null,"",null,"",null,"INC"]
[null,null,null,null,null,null,null,"",null,null,null,null,"",null,"",null,"INC"]
[null,null,null,null,null,null,null,"",null,null,null,null,"",null,"",null,"INC"]
[null,null,null,null,null,null,null,"",null,null,null,null,"",null,"",null,"INC"]
[null,null,null,null,null,null,null,"",null,null,null,null,"",null,"",null,"INC"]
[null,null,null,null,null,null,null,"",null,null,null,null,"",null,"",null,"INC"]
[null,null,null,null,null,null,null,"",null,null,null,null,"",null,"",null,"INC"]
[null,null,null,null,null,null,null,"",null,null,null,null,"",null,"",null,"INC"]
[null,null,null,null,null,null,null,"",null,null,null,null,"",null,"",null,"INC"]
[null,null,null,null,null,null,null,"",null,null,null,null,"",null,"",null,"INC"]
[null,null,null,null,null,null,null,"",null,null,null,null,"",null,"",null,"INC"]
[null,null,null,null,null,null,null,"",null,null,null,null,"",null,"",null,"INC"]
[null,null,null,null,null,null,null,"",null,null,null,null,"",null,"",null,"INC"]
[null,null,null,null,null,null,null,"",null,null,null,null,"",null,"",null,"INC"]
[null,null,null,null,null,null,null,"",null,null,null,null,"",null,"",null,"INC"]
[null,null,null,null,null,null,null,"",null,null,null,null,"",null,"",null,"INC"]
[null,null,null,null,null,null,null,"",null,null,null,null,"",null,"",null,"INC"]
[null,null,null,null,null,null,null,"",null,null,null,null,"",null,"",null,"INC"]
[null,null,null,null,null,null,null,"",null,null,null,null,"",null,"",null,"INC"]
[null,null,null,null,null,null,null,"",null,null,null,null,"",null,"",null,"INC"]
[null,null,null,null,null,null,null,"",null,null,null,null,"",null,"",null,"INC"]
[null,null,null,null,null,null,null,"",null,null,null,null,"",null,"",null,"INC"]
[null,null,null,null,null,null,null,"",null,null,null,null,"",null,"",null,"INC"]
[null,null,null,null,null,null,null,"",null,null,null,null,"",null,"",null,"INC"]
[null,null,null,null,null,null,null,"",null,null,null,null,"",null,"",null,"INC"]
[null,null,null,null,null,null,null,"",null,null,null,null,"",null,"",null,"INC"]
[null,null,null,null,null,null,null,"",null,null,null,null,"",null,"",null,"INC"]
[null,null,null,null,null,null,null,"",null,null,null,null,"",null,"",null,"INC"]
[null,null,null,null,null,null,null,"",null,null,null,null,"",null,"",null,"INC"]
[null,null,null,null,null,null,null,"",null,null,null,null,"",null,"",null,"INC"]
[null,null,null,null,null,null,null,"",null,null,null,null,"",null,"",null,"INC"]
[null,null,null,null,null,null,null,"",null,null,null,null,"",null,"",null,"INC"]
[null,null,null,null,null,null,null,"",null,null,null,null,"",null,"",null,"INC"]
[null,null,null,null,null,null,null,"",null,null,null,null,"",null,"",null,"INC"]
[null,null,null,null,null,null,null,"",null,null,null,null,"",null,"",null,"INC"]
[null,null,null,null,null,null,null,"",null,null,null,null,"",null,"",null,"INC"]
[null,null,null,null,null,null,null,"",null,null,null,null,"",null,"",null,"INC"]
[null,null,null,null,null,null,null,"",null,null,null,null,"",null,"",null,"INC"]
[null,null,null,null,null,null,null,"",null,null,null,null,"",null,"",null,"INC"]
[null,null,null,null,null,null,null,"",null,null,null,null,"",null,"",null,"INC"]
[null,null,null,null,null,null,null,"",null,null,null,null,"",null,"",null,"INC"]
[null,null,null,null,null,null,null,"",null,null,null,null,"",null,"",null,"INC"]
[null,null,null,null,null,null,null,{"$f":"IF((C527<>\"\")*AND(F527<>\"\")*AND(G527<>\"\")*AND(M527<>\"\")*AND(N527<>\"\"), IF((SQRT(M527*C527))/N527<(G527*F527),(SQRT(M527*C527))/N527,G527*F527), \"\")","v":""},null,null,null,null,{"$f":"IF((D527<>\"\")*AND(E527<>\"\")*AND(I527<>\"\")*AND(J527<>\"\")*AND(K527<>\"\"), IF((I527<J527),D527*E527,IF(D527*E527*(1-((I527-J527)/(K527-J527)))>0,D527*E527*(1-((I527-J527)/(K527-J527))),0)), \"\")","v":""},null,{"$f":"IF((C527<>\"\")*AND(N527<>\"\")*AND(P527<>\"\"), (P527^2/C527)*N527, \"\")","v":""},null,{"$f":"IF((H527<>\"\")*AND(I527<>\"\")*AND(M527<>\"\")*AND(O527<>\"\")*AND(P527<>\"\"), IF((O527<=M527)*AND(P527<=H527)*AND(I527<=K527),\"PASS\",\"FAIL\"), \"INC\")","v":"INC"}]
[null,null,null,null,null,null,null,"",null,null,null,null,"",null,"",null,"INC"]
[null,null,null,null,null,null,null,"",null,null,null,null,"",null,"",null,"INC"]
[null,null,null,null,null,null,null,"",null,null,null,null,"",null,"",null,"INC"]
[null,null,null,null,null,null,null,"",null,null,null,null,"",null,"",null,"INC"]
[null,null,null,null,null,null,null,"",null,null,null,null,"",null,"",null,"INC"]
[null,null,null,null,null,null,null,"",null,null,null,null,"",null,"",null,"INC"]
[null,null,null,null,null,null,null,"",null,null,null,null,"",null,"",null,"INC"]
[null,null,null,null,null,null,null,"",null,null,null,null,"",null,"",null,"INC"]
[null,null,null,null,null,null,null,"",null,null,null,null,"",null,"",null,"INC"]
[null,null,null,null,null,null,null,"",null,null,null,null,"",null,"",null,"INC"]
[null,null,null,null,null,null,null,"",null,null,null,null,"",null,"",null,"INC"]
[null,null,null,null,null,null,null,"",null,null,null,null,"",null,"",null,"INC"]
[null,null,null,null,null,null,null,"",null,null,null,null,"",null,"",null,"INC"]
[null,null,null,null,null,null,null,"",null,null,null,null,"",null,"",null,"INC"]
[null,null,null,null,null,null,null,"",null,null,null,null,"",null,"",null,"INC"]
[null,null,null,null,null,null,null,"",null,null,null,null,"",null,"",null,"INC"]
[null,null,null,null,null,null,null,"",null,null,null,null,"",null,"",null,"INC"]
[null,null,null,null,null,null,null,"",null,null,null,null,"",null,"",null,"INC"]
[null,null,null,null,null,null,null,"",null,null,null,null,"",null,"",null,"INC"]
[null,null,null,null,null,null,null,"",null,null,null,null,"",null,"",null,"INC"]
[null,null,null,null,null,null,null,"",null,null,null,null,"",null,"",null,"INC"]
[null,null,null,null,null,null,null,"",null,null,null,null,"",null,"",null,"INC"]
[null,null,null,null,null,null,null,"",null,null,null,null,"",null,"",null,"INC"]
[null,null,null,null,null,null,null,"",null,null,null,null,"",null,"",null,"INC"]
[null,null,null,null,null,null,null,"",null,null,null,null,"",null,"",null,"INC"]
[null,null,null,null,null,null,null,"",null,null,null,null,"",null,"",null,"INC"]
[null,null,null,null,null,null,null,"",null,null,null,null,"",null,"",null,"INC"]
[null,null,null,null,null,null,null,"",null,null,null,null,"",null,"",null,"INC"]
[null,null,null,null,null,null,null,"",null,null,null,null,"",null,"",null,"INC"]
[null,null,null,null,null,null,null,"",null,null,null,null,"",null,"",null,"INC"]
[null,null,null,null,null,null,null,"",null,null,null,null,"",null,"",null,"INC"]
[null,null,null,null,null,null,null,"",null,null,null,null,"",null,"",null,"INC"]
[null,null,null,null,null,null,null,"",null,null,null,null,"",null,"",null,"INC"]
[null,null,null,null,null,null,null,"",null,null,null,null,"",null,"",null,"INC"]
[null,null,null,null,null,null,null,"",null,null,null,null,"",null,"",null,"INC"]
[null,null,null,null,null,null,null,"",null,null,null,null,"",null,"",null,"INC"]
[null,null,null,null,null,null,null,"",null,null,null,null,"",null,"",null,"INC"]
[null,null,null,null,null,null,null,"",null,null,null,null,"",null,"",null,"INC"]
[null,null,null,null,null,null,null,"",null,null,null,null,"",null,"",null,"INC"]
[null,null,null,null,null,null,null,"",null,null,null,null,"",null,"",null,"INC"]
[null,null,null,null,null,null,null,"",null,null,null,null,"",null,"",null,"INC"]
[null,null,null,null,null,null,null,"",null,null,null,null,"",null,"",null,"INC"]
[null,null,null,null,null,null,null,"",null,null,null,null,"",null,"",null,"INC"]
[null,null,null,null,null,null,null,"",null,null,null,null,"",null,"",null,"INC"]
[null,null,null,null,null,null,null,"",null,null,null,null,"",null,"",null,"INC"]
[null,null,null,null,null,null,null,"",null,null,null,null,"",null,"",null,"INC"]
[null,null,null,null,null,null,null,"",null,null,null,null,"",null,"",null,"INC"]
[null,null,null,null,null,null,null,"",null,null,null,null,"",null,"",null,"INC"]
[null,null,null,null,null,null,null,"",null,null,null,null,"",null,"",null,"INC"]
[null,null,null,null,null,null,null,"",null,null,null,null,"",null,"",null,"INC"]
[null,null,null,null,null,null,null,"",null,null,null,null,"",null,"",null,"INC"]
[null,null,null,null,null,null,null,"",null,null,null,null,"",null,"",null,"INC"]
[null,null,null,null,null,null,null,"",null,null,null,null,"",null,"",null,"INC"]
[null,null,null,null,null,null,null,"",null,null,null,null,"",null,"",null,"INC"]
[null,null,null,null,null,null,null,"",null,null,null,null,"",null,"",null,"INC"]
[null,null,null,null,null,null,null,"",null,null,null,null,"",null,"",null,"INC"]
[null,null,null,null,null,null,null,"",null,null,null,null,"",null,"",null,"INC"]
[null,null,null,null,null,null,null,"",null,null,null,null,"",null,"",null,"INC"]
[null,null,null,null,null,null,null,"",null,null,null,null,"",null,"",null,"INC"]
[null,null,null,null,null,null,null,"",null,null,null,null,"",null,"",null,"INC"]
[null,null,null,null,null,null,null,"",null,null,null,null,"",null,"",null,"INC"]
[null,null,null,null,null,null,null,"",null,null,null,null,"",null,"",null,"INC"]
[null,null,null,null,null,null,null,"",null,null,null,null,"",null,"",null,"INC"]
[null,null,null,null,null,null,null,{"$f":"IF((C591<>\"\")*AND(F591<>\"\")*AND(G591<>\"\")*AND(M591<>\"\")*AND(N591<>\"\"), IF((SQRT(M591*C591))/N591<(G591*F591),(SQRT(M591*C591))/N591,G591*F591), \"\")","v":""},null,null,null,null,{"$f":"IF((D591<>\"\")*AND(E591<>\"\")*AND(I591<>\"\")*AND(J591<>\"\")*AND(K591<>\"\"), IF((I591<J591),D591*E591,IF(D591*E591*(1-((I591-J591)/(K591-J591)))>0,D591*E591*(1-((I591-J591)/(K591-J591))),0)), \"\")","v":""},null,{"$f":"IF((C591<>\"\")*AND(N591<>\"\")*AND(P591<>\"\"), (P591^2/C591)*N591, \"\")","v":""},null,{"$f":"IF((H591<>\"\")*AND(I591<>\"\")*AND(M591<>\"\")*AND(O591<>\"\")*AND(P591<>\"\"), IF((O591<=M591)*AND(P591<=H591)*AND(I591<=K591),\"PASS\",\"FAIL\"), \"INC\")","v":"INC"}]
[null,null,null,null,null,null,null,"",null,null,null,null,"",null,"",null,"INC"]
[null,null,null,null,null,null,null,"",null,null,null,null,"",null,"",null,"INC"]
[null,null,null,null,null,null,null,"",null,null,null,null,"",null,"",null,"INC"]
[null,null,null,null,null,null,null,"",null,null,null,null,"",null,"",null,"INC"]
[null,null,null,null,null,null,null,"",null,null,null,null,"",null,"",null,"INC"]
[null,null,null,null,null,null,null,"",null,null,null,null,"",null,"",null,"INC"]
[null,null,null,null,null,null,null,"",null,null,null,null,"",null,"",null,"INC"]
[null,null,null,null,null,null,null,"",null,null,null,null,"",null,"",null,"INC"]
[null,null,null,null,null,null,null,"",null,null,null,null,"",null,"",null,"INC"]
[null,null,null,null,null,null,null,"",null,null,null,null,"",null,"",null,"INC"]
[null,null,null,null,null,null,null,"",null,null,null,null,"",null,"",null,"INC"]
[null,null,null,null,null,null,null,"",null,null,null,null,"",null,"",null,"INC"]
[null,null,null,null,null,null,null,"",null,null,null,null,"",null,"",null,"INC"]
[null,null,null,null,null,null,null,"",null,null,null,null,"",null,"",null,"INC"]
[null,null,null,null,null,null,null,"",null,null,null,null,"",null,"",null,"INC"]
[null,null,null,null,null,null,null,"",null,null,null,null,"",null,"",null,"INC"]
[null,null,null,null,null,null,null,"",null,null,null,null,"",null,"",null,"INC"]
[null,null,null,null,null,null,null,"",null,null,null,null,"",null,"",null,"INC"]
[null,null,null,null,null,null,null,"",null,null,null,null,"",null,"",null,"INC"]
[null,null,null,null,null,null,null,"",null,null,null,null,"",null,"",null,"INC"]
[null,null,null,null,null,null,null,"",null,null,null,null,"",null,"",null,"INC"]
[null,null,null,null,null,null,null,"",null,null,null,null,"",null,"",null,"INC"]
[null,null,null,null,null,null,null,"",null,null,null,null,"",null,"",null,"INC"]
[null,null,null,null,null,null,null,"",null,null,null,null,"",null,"",null,"INC"]
[null,null,null,null,null,null,null,"",null,null,null,null,"",null,"",null,"INC"]
[null,null,null,null,null,null,null,"",null,null,null,null,"",null,"",null,"INC"]
[null,null,null,null,null,null,null,"",null,null,null,null,"",null,"",null,"INC"]
[null,null,null,null,null,null,null,"",null,null,null,null,"",null,"",null,"INC"]
[null,null,null,null,null,null,null,"",null,null,null,null,"",null,"",null,"INC"]
[null,null,null,null,null,null,null,"",null,null,null,null,"",null,"",null,"INC"]
[null,null,null,null,null,null,null,"",null,null,null,null,"",null,"",null,"INC"]
[null,null,null,null,null,null,null,"",null,null,null,null,"",null,"",null,"INC"]
[null,null,null,null,null,null,null,"",null,null,null,null,"",null,"",null,"INC"]
[null,null,null,null,null,null,null,"",null,null,null,null,"",null,"",null,"INC"]
[null,null,null,null,null,null,null,"",null,null,null,null,"",null,"",null,"INC"]
[null,null,null,null,null,null,null,"",null,null,null,null,"",null,"",null,"INC"]
[null,null,null,null,null,null,null,"",null,null,null,null,"",null,"",null,"INC"]
[null,null,null,null,null,null,null,"",null,null,null,null,"",null,"",null,"INC"]
[null,null,null,null,null,null,null,"",null,null,null,null,"",null,"",null,"INC"]
[null,null,null,null,null,null,null,"",null,null,null,null,"",null,"",null,"INC"]
[null,null,null,null,null,null,null,"",null,null,null,null,"",null,"",null,"INC"]
[null,null,null,null,null,null,null,"",null,null,null,null,"",null,"",null,"INC"]
[null,null,null,null,null,null,null,"",null,null,null,null,"",null,"",null,"INC"]
[null,null,null,null,null,null,null,"",null,null,null,null,"",null,"",null,"INC"]
[null,null,null,null,null,null,null,"",null,null,null,null,"",null,"",null,"INC"]
[null,null,null,null,null,null,null,"",null,null,null,null,"",null,"",null,"INC"]
[null,null,null,null,null,null,null,"",null,null,null,null,"",null,"",null,"INC"]
[null,null,null,null,null,null,null,"",null,null,null,null,"",null,"",null,"INC"]
[null,null,null,null,null,null,null,"",null,null,null,null,"",null,"",null,"INC"]
[null,null,null,null,null,null,null,"",null,null,null,null,"",null,"",null,"INC"]
[null,null,null,null,null,null,null,"",null,null,null,null,"",null,"",null,"INC"]
[null,null,null,null,null,null,null,"",null,null,null,null,"",null,"",null,"INC"]
[null,null,null,null,null,null,null,"",null,null,null,null,"",null,"",null,"INC"]
[null,null,null,null,null,null,null,"",null,null,null,null,"",null,"",null,"INC"]
[null,null,null,null,null,null,null,"",null,null,null,null,"",null,"",null,"INC"]
[null,null,null,null,null,null,null,"",null,null,null,null,"",null,"",null,"INC"]
[null,null,null,null,null,null,null,"",null,null,null,null,"",null,"",null,"INC"]
[null,null,null,null,null,null,null,"",null,null,null,null,"",null,"",null,"INC"]
[null,null,null,null,null,null,null,"",null,null,null,null,"",null,"",null,"INC"]
[null,null,null,null,null,null,null,"",null,null,null,null,"",null,"",null,"INC"]
[null,null,null,null,null,null,null,"",null,null,null,null,"",null,"",null,"INC"]
[null,null,null,null,null,null,null,"",null,null,null,null,"",null,"",null,"INC"]
[null,null,null,null,null,null,null,"",null,null,null,null,"",null,"",null,"INC"]
[null,null,null,null,null,null,null,{"$f":"IF((C655<>\"\")*AND(F655<>\"\")*AND(G655<>\"\")*AND(M655<>\"\")*AND(N655<>\"\"), IF((SQRT(M655*C655))/N655<(G655*F655),(SQRT(M655*C655))/N655,G655*F655), \"\")","v":""},null,null,null,null,{"$f":"IF((D655<>\"\")*AND(E655<>\"\")*AND(I655<>\"\")*AND(J655<>\"\")*AND(K655<>\"\"), IF((I655<J655),D655*E655,IF(D655*E655*(1-((I655-J655)/(K655-J655)))>0,D655*E655*(1-((I655-J655)/(K655-J655))),0)), \"\")","v":""},null,{"$f":"IF((C655<>\"\")*AND(N655<>\"\")*AND(P655<>\"\"), (P655^2/C655)*N655, \"\")","v":""},null,{"$f":"IF((H655<>\"\")*AND(I655<>\"\")*AND(M655<>\"\")*AND(O655<>\"\")*AND(P655<>\"\"), IF((O655<=M655)*AND(P655<=H655)*AND(I655<=K655),\"PASS\",\"FAIL\"), \"INC\")","v":"INC"}]
[null,null,null,null,null,null,null,"",null,null,null,null,"",null,"",null,"INC"]
[null,null,null,null,null,null,null,"",null,null,null,null,"",null,"",null,"INC"]
[null,null,null,null,null,null,null,"",null,null,null,null,"",null,"",null,"INC"]
[null,null,null,null,null,null,null,"",null,null,null,null,"",null,"",null,"INC"]
[null,null,null,null,null,null,null,"",null,null,null,null,"",null,"",null,"INC"]
[null,null,null,null,null,null,null,"",null,null,null,null,"",null,"",null,"INC"]
[null,null,null,null,null,null,null,"",null,null,null,null,"",null,"",null,"INC"]
[null,null,null,null,null,null,null,"",null,null,null,null,"",null,"",null,"INC"]
[null,null,null,null,null,null,null,"",null,null,null,null,"",null,"",null,"INC"]
[null,null,null,null,null,null,null,"",null,null,null,null,"",null,"",null,"INC"]
[null,null,null,null,null,null,null,"",null,null,null,null,"",null,"",null,"INC"]
[null,null,null,null,null,null,null,"",null,null,null,null,"",null,"",null,"INC"]
[null,null,null,null,null,null,null,"",null,null,null,null,"",null,"",null,"INC"]
[null,null,null,null,null,null,null,"",null,null,null,null,"",null,"",null,"INC"]
[null,null,null,null,null,null,null,"",null,null,null,null,"",null,"",null,"INC"]
[null,null,null,null,null,null,null,"",null,null,null,null,"",null,"",null,"INC"]
[null,null,null,null,null,null,null,"",null,null,null,null,"",null,"",null,"INC"]
[null,null,null,null,null,null,null,"",null,null,null,null,"",null,"",null,"INC"]
[null,null,null,null,null,null,null,"",null,null,null,null,"",null,"",null,"INC"]
[null,null,null,null,null,null,null,"",null,null,null,null,"",null,"",null,"INC"]
[null,null,null,null,null,null,null,"",null,null,null,null,"",null,"",null,"INC"]
[null,null,null,null,null,null,null,"",null,null,null,null,"",null,"",null,"INC"]
[null,null,null,null,null,null,null,"",null,null,null,null,"",null,"",null,"INC"]
[null,null,null,null,null,null,null,"",null,null,null,null,"",null,"",null,"INC"]
[null,null,null,null,null,null,null,"",null,null,null,null,"",null,"",null,"INC"]
[null,null,null,null,null,null,null,"",null,null,null,null,"",null,"",null,"INC"]
[null,null,null,null,null,null,null,"",null,null,null,null,"",null,"",null,"INC"]
[null,null,null,null,null,null,null,"",null,null,null,null,"",null,"",null,"INC"]
[null,null,null,null,null,null,null,"",null,null,null,null,"",null,"",null,"INC"]
[null,null,null,null,null,null,null,"",null,null,null,null,"",null,"",null,"INC"]
[null,null,null,null,null,null,null,"",null,null,null,null,"",null,"",null,"INC"]
[null,null,null,null,null,null,null,"",null,null,null,null,"",null,"",null,"INC"]
[null,null,null,null,null,null,null,"",null,null,null,null,"",null,"",null,"INC"]
[null,null,null,null,null,null,null,"",null,null,null,null,"",null,"",null,"INC"]
[null,null,null,null,null,null,null,"",null,null,null,null,"",null,"",null,"INC"]
[null,null,null,null,null,null,null,"",null,null,null,null,"",null,"",null,"INC"]
[null,null,null,null,null,null,null,"",null,null,null,null,"",null,"",null,"INC"]
[null,null,null,null,null,null,null,"",null,null,null,null,"",null,"",null,"INC"]
[null,null,null,null,null,null,null,"",null,null,null,null,"",null,"",null,"INC"]
[null,null,null,null,null,null,null,"",null,null,null,null,"",null,"",null,"INC"]
[null,null,null,null,null,null,null,"",null,null,null,null,"",null,"",null,"INC"]
[null,null,null,null,null,null,null,"",null,null,null,null,"",null,"",null,"INC"]
[null,null,null,null,null,null,null,"",null,null,null,null,"",null,"",null,"INC"]
[null,null,null,null,null,null,null,"",null,null,null,null,"",null,"",null,"INC"]
[null,null,null,null,null,null,null,"",null,null,null,null,"",null,"",null,"INC"]
[null,null,null,null,null,null,null,"",null,null,null,null,"",null,"",null,"INC"]
[null,null,null,null,null,null,null,"",null,null,null,null,"",null,"",null,"INC"]
[null,null,null,null,null,null,null,"",null,null,null,null,"",null,"",null,"INC"]
[null,null,null,null,null,null,null,"",null,null,null,null,"",null,"",null,"INC"]
[null,null,null,null,null,null,null,"",null,null,null,null,"",null,"",null,"INC"]
[null,null,null,null,null,null,null,"",null,null,null,null,"",null,"",null,"INC"]
[null,null,null,null,null,null,null,"",null,null,null,null,"",null,"",null,"INC"]
[null,null,null,null,null,null,null,"",null,null,null,null,"",null,"",null,"INC"]
[null,null,null,null,null,null,null,"",null,null,null,null,"",null,"",null,"INC"]
[null,null,null,null,null,null,null,"",null,null,null,null,"",null,"",null,"INC"]
[null,null,null,null,null,null,null,"",null,null,null,null,"",null,"",null,"INC"]
[null,null,null,null,null,null,null,"",null,null,null,null,"",null,"",null,"INC"]
[null,null,null,null,null,null,null,"",null,null,null,null,"",null,"",null,"INC"]
[null,null,null,null,null,null,null,"",null,null,null,null,"",null,"",null,"INC"]
[null,null,null,null,null,null,null,"",null,null,null,null,"",null,"",null,"INC"]
[null,null,null,null,null,null,null,"",null,null,null,null,"",null,"",null,"INC"]
[null,null,null,null,null,null,null,"",null,null,null,null,"",null,"",null,"INC"]
[null,null,null,null,null,null,null,"",null,null,null,null,"",null,"",null,"INC"]
[null,null,null,null,null,null,null,{"$f":"IF((C719<>\"\")*AND(F719<>\"\")*AND(G719<>\"\")*AND(M719<>\"\")*AND(N719<>\"\"), IF((SQRT(M719*C719))/N719<(G719*F719),(SQRT(M719*C719))/N719,G719*F719), \"\")","v":""},null,null,null,null,{"$f":"IF((D719<>\"\")*AND(E719<>\"\")*AND(I719<>\"\")*AND(J719<>\"\")*AND(K719<>\"\"), IF((I719<J719),D719*E719,IF(D719*E719*(1-((I719-J719)/(K719-J719)))>0,D719*E719*(1-((I719-J719)/(K719-J719))),0)), \"\")","v":""},null,{"$f":"IF((C719<>\"\")*AND(N719<>\"\")*AND(P719<>\"\"), (P719^2/C719)*N719, \"\")","v":""},null,{"$f":"IF((H719<>\"\")*AND(I719<>\"\")*AND(M719<>\"\")*AND(O719<>\"\")*AND(P719<>\"\"), IF((O719<=M719)*AND(P719<=H719)*AND(I719<=K719),\"PASS\",\"FAIL\"), \"INC\")","v":"INC"}]
[null,null,null,null,null,null,null,"",null,null,null,null,"",null,"",null,"INC"]
[null,null,null,null,null,null,null,"",null,null,null,null,"",null,"",null,"INC"]
[null,null,null,null,null,null,null,"",null,null,null,null,"",null,"",null,"INC"]
[null,null,null,null,null,null,null,"",null,null,null,null,"",null,"",null,"INC"]
[null,null,null,null,null,null,null,"",null,null,null,null,"",null,"",null,"INC"]
[null,null,null,null,null,null,null,"",null,null,null,null,"",null,"",null,"INC"]
[null,null,null,null,null,null,null,"",null,null,null,null,"",null,"",null,"INC"]
[null,null,null,null,null,null,null,"",null,null,null,null,"",null,"",null,"INC"]
[null,null,null,null,null,null,null,"",null,null,null,null,"",null,"",null,"INC"]
[null,null,null,null,null,null,null,"",null,null,null,null,"",null,"",null,"INC"]
[null,null,null,null,null,null,null,"",null,null,null,null,"",null,"",null,"INC"]
[null,null,null,null,null,null,null,"",null,null,null,null,"",null,"",null,"INC"]
[null,null,null,null,null,null,null,"",null,null,null,null,"",null,"",null,"INC"]
[null,null,null,null,null,null,null,"",null,null,null,null,"",null,"",null,"INC"]
[null,null,null,null,null,null,null,"",null,null,null,null,"",null,"",null,"INC"]
[null,null,null,null,null,null,null,"",null,null,null,null,"",null,"",null,"INC"]
[null,null,null,null,null,null,null,"",null,null,null,null,"",null,"",null,"INC"]
[null,null,null,null,null,null,null,"",null,null,null,null,"",null,"",null,"INC"]
[null,null,null,null,null,null,null,"",null,null,null,null,"",null,"",null,"INC"]
[null,null,null,null,null,null,null,"",null,null,null,null,"",null,"",null,"INC"]
[null,null,null,null,null,null,null,"",null,null,null,null,"",null,"",null,"INC"]
[null,null,null,null,null,null,null,"",null,null,null,null,"",null,"",null,"INC"]
[null,null,null,null,null,null,null,"",null,null,null,null,"",null,"",null,"INC"]
[null,null,null,null,null,null,null,"",null,null,null,null,"",null,"",null,"INC"]
[null,null,null,null,null,null,null,"",null,null,null,null,"",null,"",null,"INC"]
[null,null,null,null,null,null,null,"",null,null,null,null,"",null,"",null,"INC"]
[null,null,null,null,null,null,null,"",null,null,null,null,"",null,"",null,"INC"]
[null,null,null,null,null,null,null,"",null,null,null,null,"",null,"",null,"INC"]
[null,null,null,null,null,null,null,"",null,null,null,null,"",null,"",null,"INC"]
[null,null,null,null,null,null,null,"",null,null,null,null,"",null,"",null,"INC"]
[null,null,null,null,null,null,null,"",null,null,null,null,"",null,"",null,"INC"]
[null,null,null,null,null,null,null,"",null,null,null,null,"",null,"",null,"INC"]
[null,null,null,null,null,null,null,"",null,null,null,null,"",null,"",null,"INC"]
[null,null,null,null,null,null,null,"",null,null,null,null,"",null,"",null,"INC"]
[null,null,null,null,null,null,null,"",null,null,null,null,"",null,"",null,"INC"]
[null,null,null,null,null,null,null,"",null,null,null,null,"",null,"",null,"INC"]
[null,null,null,null,null,null,null,"",null,null,null,null,"",null,"",null,"INC"]
[null,null,null,null,null,null,null,"",null,null,null,null,"",null,"",null,"INC"]
[null,null,null,null,null,null,null,"",null,null,null,null,"",null,"",null,"INC"]
[null,null,null,null,null,null,null,"",null,null,null,null,"",null,"",null,"INC"]
[null,null,null,null,null,null,null,"",null,null,null,null,"",null,"",null,"INC"]
[null,null,null,null,null,null,null,"",null,null,null,null,"",null,"",null,"INC"]
[null,null,null,null,null,null,null,"",null,null,null,null,"",null,"",null,"INC"]
[null,null,null,null,null,null,null,"",null,null,null,null,"",null,"",null,"INC"]
[null,null,null,null,null,null,null,"",null,null,null,null,"",null,"",null,"INC"]
[null,null,null,null,null,null,null,"",null,null,null,null,"",null,"",null,"INC"]
[null,null,null,null,null,null,null,"",null,null,null,null,"",null,"",null,"INC"]
[null,null,null,null,null,null,null,"",null,null,null,null,"",null,"",null,"INC"]
[null,null,null,null,null,null,null,"",null,null,null,null,"",null,"",null,"INC"]
[null,null,null,null,null,null,null,"",null,null,null,null,"",null,"",null,"INC"]
[null,null,null,null,null,null,null,"",null,null,null,null,"",null,"",null,"INC"]
[null,null,null,null,null,null,null,"",null,null,null,null,"",null,"",null,"INC"]
[null,null,null,null,null,null,null,"",null,null,null,null,"",null,"",null,"INC"]
[null,null,null,null,null,null,null,"",null,null,null,null,"",null,"",null,"INC"]
[null,null,null,null,null,null,null,"",null,null,null,null,"",null,"",null,"INC"]
[null,null,null,null,null,null,null,"",null,null,null,null,"",null,"",null,"INC"]
[null,null,null,null,null,null,null,"",null,null,null,null,"",null,"",null,"INC"]
[null,null,null,null,null,null,null,"",null,null,null,null,"",null,"",null,"INC"]
[null,null,null,null,null,null,null,"",null,null,null,null,"",null,"",null,"INC"]
[null,null,null,null,null,null,null,"",null,null,null,null,"",null,"",null,"INC"]
[null,null,null,null,null,null,null,"",null,null,null,null,"",null,"",null,"INC"]
[null,null,null,null,null,null,null,"",null,null,null,null,"",null,"",null,"INC"]
[null,null,null,null,null,null,null,"",null,null,null,null,"",null,"",null,"INC"]
[null,null,null,null,null,null,null,{"$f":"IF((C783<>\"\")*AND(F783<>\"\")*AND(G783<>\"\")*AND(M783<>\"\")*AND(N783<>\"\"), IF((SQRT(M783*C783))/N783<(G783*F783),(SQRT(M783*C783))/N783,G783*F783), \"\")","v":""},null,null,null,null,{"$f":"IF((D783<>\"\")*AND(E783<>\"\")*AND(I783<>\"\")*AND(J783<>\"\")*AND(K783<>\"\"), IF((I783<J783),D783*E783,IF(D783*E783*(1-((I783-J783)/(K783-J783)))>0,D783*E783*(1-((I783-J783)/(K783-J783))),0)), \"\")","v":""},null,{"$f":"IF((C783<>\"\")*AND(N783<>\"\")*AND(P783<>\"\"), (P783^2/C783)*N783, \"\")","v":""},null,{"$f":"IF((H783<>\"\")*AND(I783<>\"\")*AND(M783<>\"\")*AND(O783<>\"\")*AND(P783<>\"\"), IF((O783<=M783)*AND(P783<=H783)*AND(I783<=K783),\"PASS\",\"FAIL\"), \"INC\")","v":"INC"}]
[null,null,null,null,null,null,null,"",null,null,null,null,"",null,"",null,"INC"]
[null,null,null,null,null,null,null,"",null,null,null,null,"",null,"",null,"INC"]
[null,null,null,null,null,null,null,"",null,null,null,null,"",null,"",null,"INC"]
[null,null,null,null,null,null,null,"",null,null,null,null,"",null,"",null,"INC"]
[null,null,null,null,null,null,null,"",null,null,null,null,"",null,"",null,"INC"]
[null,null,null,null,null,null,null,"",null,null,null,null,"",null,"",null,"INC"]
[null,null,null,null,null,null,null,"",null,null,null,null,"",null,"",null,"INC"]
[null,null,null,null,null,null,null,"",null,null,null,null,"",null,"",null,"INC"]
[null,null,null,null,null,null,null,"",null,null,null,null,"",null,"",null,"INC"]
[null,null,null,null,null,null,null,"",null,null,null,null,"",null,"",null,"INC"]
[null,null,null,null,null,null,null,"",null,null,null,null,"",null,"",null,"INC"]
[null,null,null,null,null,null,null,"",null,null,null,null,"",null,"",null,"INC"]
[null,null,null,null,null,null,null,"",null,null,null,null,"",null,"",null,"INC"]
[null,null,null,null,null,null,null,"",null,null,null,null,"",null,"",null,"INC"]
[null,null,null,null,null,null,null,"",null,null,null,null,"",null,"",null,"INC"]
[null,null,null,null,null,null,null,"",null,null,null,null,"",null,"",null,"INC"]
[null,null,null,null,null,null,null,"",null,null,null,null,"",null,"",null,"INC"]
[null,null,null,null,null,null,null,"",null,null,null,null,"",null,"",null,"INC"]
[null,null,null,null,null,null,null,"",null,null,null,null,"",null,"",null,"INC"]
[null,null,null,null,null,null,null,"",null,null,null,null,"",null,"",null,"INC"]
[null,null,null,null,null,null,null,"",null,null,null,null,"",null,"",null,"INC"]
[null,null,null,null,null,null,null,"",null,null,null,null,"",null,"",null,"INC"]
[null,null,null,null,null,null,null,"",null,null,null,null,"",null,"",null,"INC"]
[null,null,null,null,null,null,null,"",null,null,null,null,"",null,"",null,"INC"]
[null,null,null,null,null,null,null,"",null,null,null,null,"",null,"",null,"INC"]
[null,null,null,null,null,null,null,"",null,null,null,null,"",null,"",null,"INC"]
[null,null,null,null,null,null,null,"",null,null,null,null,"",null,"",null,"INC"]
[null,null,null,null,null,null,null,"",null,null,null,null,"",null,"",null,"INC"]
[null,null,null,null,null,null,null,"",null,null,null,null,"",null,"",null,"INC"]
[null,null,null,null,null,null,null,"",null,null,null,null,"",null,"",null,"INC"]
[null,null,null,null,null,null,null,"",null,null,null,null,"",null,"",null,"INC"]
[null,null,null,null,null,null,null,"",null,null,null,null,"",null,"",null,"INC"]
[null,null,null,null,null,null,null,"",null,null,null,null,"",null,"",null,"INC"]
[null,null,null,null,null,null,null,"",null,null,null,null,"",null,"",null,"INC"]
[null,null,null,null,null,null,null,"",null,null,null,null,"",null,"",null,"INC"]
[null,null,null,null,null,null,null,"",null,null,null,null,"",null,"",null,"INC"]
[null,null,null,null,null,null,null,"",null,null,null,null,"",null,"",null,"INC"]
[null,null,null,null,null,null,null,"",null,null,null,null,"",null,"",null,"INC"]
[null,null,null,null,null,null,null,"",null,null,null,null,"",null,"",null,"INC"]
[null,null,null,null,null,null,null,"",null,null,null,null,"",null,"",null,"INC"]
[null,null,null,null,null,null,null,"",null,null,null,null,"",null,"",null,"INC"]
[null,null,null,null,null,null,null,"",null,null,null,null,"",null,"",null,"INC"]
[null,null,null,null,null,null,null,"",null,null,null,null,"",null,"",null,"INC"]
[null,null,null,null,null,null,null,"",null,null,null,null,"",null,"",null,"INC"]
[null,null,null,null,null,null,null,"",null,null,null,null,"",null,"",null,"INC"]
[null,null,null,null,null,null,null,"",null,null,null,null,"",null,"",null,"INC"]
[null,null,null,null,null,null,null,"",null,null,null,null,"",null,"",null,"INC"]
[null,null,null,null,null,null,null,"",null,null,null,null,"",null,"",null,"INC"]
[null,null,null,null,null,null,null,"",null,null,null,null,"",null,"",null,"INC"]
[null,null,null,null,null,null,null,"",null,null,null,null,"",null,"",null,"INC"]
[null,null,null,null,null,null,null,"",null,null,null,null,"",null,"",null,"INC"]
[null,null,null,null,null,null,null,"",null,null,null,null,"",null,"",null,"INC"]
[null,null,null,null,null,null,null,"",null,null,null,null,"",null,"",null,"INC"]
[null,null,null,null,null,null,null,"",null,null,null,null,"",null,"",null,"INC"]
[null,null,null,null,null,null,null,"",null,null,null,null,"",null,"",null,"INC"]
[null,null,null,null,null,null,null,"",null,null,null,null,"",null,"",null,"INC"]
[null,null,null,null,null,null,null,"",null,null,null,null,"",null,"",null,"INC"]
[null,null,null,null,null,null,null,"",null,null,null,null,"",null,"",null,"INC"]
[null,null,null,null,null,null,null,"",null,null,null,null,"",null,"",null,"INC"]
[null,null,null,null,null,null,null,"",null,null,null,null,"",null,"",null,"INC"]
[null,null,null,null,null,null,null,"",null,null,null,null,"",null,"",null,"INC"]
[null,null,null,null,null,null,null,"",null,null,null,null,"",null,"",null,"INC"]
[null,null,null,null,null,null,null,"",null,null,null,null,"",null,"",null,"INC"]
[null,null,null,null,null,null,null,{"$f":"IF((C847<>\"\")*AND(F847<>\"\")*AND(G847<>\"\")*AND(M847<>\"\")*AND(N847<>\"\"), IF((SQRT(M847*C847))/N847<(G847*F847),(SQRT(M847*C847))/N847,G847*F847), \"\")","v":""},null,null,null,null,{"$f":"IF((D847<>\"\")*AND(E847<>\"\")*AND(I847<>\"\")*AND(J847<>\"\")*AND(K847<>\"\"), IF((I847<J847),D847*E847,IF(D847*E847*(1-((I847-J847)/(K847-J847)))>0,D847*E847*(1-((I847-J847)/(K847-J847))),0)), \"\")","v":""},null,{"$f":"IF((C847<>\"\")*AND(N847<>\"\")*AND(P847<>\"\"), (P847^2/C847)*N847, \"\")","v":""},null,{"$f":"IF((H847<>\"\")*AND(I847<>\"\")*AND(M847<>\"\")*AND(O847<>\"\")*AND(P847<>\"\"), IF((O847<=M847)*AND(P847<=H847)*AND(I847<=K847),\"PASS\",\"FAIL\"), \"INC\")","v":"INC"}]
[null,null,null,null,null,null,null,"",null,null,null,null,"",null,"",null,"INC"]
[null,null,null,null,null,null,null,"",null,null,null,null,"",null,"",null,"INC"]
[null,null,null,null,null,null,null,"",null,null,null,null,"",null,"",null,"INC"]
[null,null,null,null,null,null,null,"",null,null,null,null,"",null,"",null,"INC"]
[null,null,null,null,null,null,null,"",null,null,null,null,"",null,"",null,"INC"]
[null,null,null,null,null,null,null,"",null,null,null,null,"",null,"",null,"INC"]
[null,null,null,null,null,null,null,"",null,null,null,null,"",null,"",null,"INC"]
[null,null,null,null,null,null,null,"",null,null,null,null,"",null,"",null,"INC"]
[null,null,null,null,null,null,null,"",null,null,null,null,"",null,"",null,"INC"]
[null,null,null,null,null,null,null,"",null,null,null,null,"",null,"",null,"INC"]
[null,null,null,null,null,null,null,"",null,null,null,null,"",null,"",null,"INC"]
[null,null,null,null,null,null,null,"",null,null,null,null,"",null,"",null,"INC"]
[null,null,null,null,null,null,null,"",null,null,null,null,"",null,"",null,"INC"]
[null,null,null,null,null,null,null,"",null,null,null,null,"",null,"",null,"INC"]
[null,null,null,null,null,null,null,"",null,null,null,null,"",null,"",null,"INC"]
[null,null,null,null,null,null,null,"",null,null,null,null,"",null,"",null,"INC"]
[null,null,null,null,null,null,null,"",null,null,null,null,"",null,"",null,"INC"]
[null,null,null,null,null,null,null,"",null,null,null,null,"",null,"",null,"INC"]
[null,null,null,null,null,null,null,"",null,null,null,null,"",null,"",null,"INC"]
[null,null,null,null,null,null,null,"",null,null,null,null,"",null,"",null,"INC"]
[null,null,null,null,null,null,null,"",null,null,null,null,"",null,"",null,"INC"]
[null,null,null,null,null,null,null,"",null,null,null,null,"",null,"",null,"INC"]
[null,null,null,null,null,null,null,"",null,null,null,null,"",null,"",null,"INC"]
[null,null,null,null,null,null,null,"",null,null,null,null,"",null,"",null,"INC"]
[null,null,null,null,null,null,null,"",null,null,null,null,"",null,"",null,"INC"]
[null,null,null,null,null,null,null,"",null,null,null,null,"",null,"",null,"INC"]
[null,null,null,null,null,null,null,"",null,null,null,null,"",null,"",null,"INC"]
[null,null,null,null,null,null,null,"",null,null,null,null,"",null,"",null,"INC"]
[null,null,null,null,null,null,null,"",null,null,null,null,"",null,"",null,"INC"]
[null,null,null,null,null,null,null,"",null,null,null,null,"",null,"",null,"INC"]
[null,null,null,null,null,null,null,"",null,null,null,null,"",null,"",null,"INC"]
[null,null,null,null,null,null,null,"",null,null,null,null,"",null,"",null,"INC"]
[null,null,null,null,null,null,null,"",null,null,null,null,"",null,"",null,"INC"]
[null,null,null,null,null,null,null,"",null,null,null,null,"",null,"",null,"INC"]
[null,null,null,null,null,null,null,"",null,null,null,null,"",null,"",null,"INC"]
[null,null,null,null,null,null,null,"",null,null,null,null,"",null,"",null,"INC"]
[null,null,null,null,null,null,null,"",null,null,null,null,"",null,"",null,"INC"]
[null,null,null,null,null,null,null,"",null,null,null,null,"",null,"",null,"INC"]
[null,null,null,null,null,null,null,"",null,null,null,null,"",null,"",null,"INC"]
[null,null,null,null,null,null,null,"",null,null,null,null,"",null,"",null,"INC"]
[null,null,null,null,null,null,null,"",null,null,null,null,"",null,"",null,"INC"]
[null,null,null,null,null,null,null,"",null,null,null,null,"",null,"",null,"INC"]
[null,null,null,null,null,null,null,"",null,null,null,null,"",null,"",null,"INC"]
[null,null,null,null,null,null,null,"",null,null,null,null,"",null,"",null,"INC"]
[null,null,null,null,null,null,null,"",null,null,null,null,"",null,"",null,"INC"]
[null,null,null,null,null,null,null,"",null,null,null,null,"",null,"",null,"INC"]
[null,null,null,null,null,null,null,"",null,null,null,null,"",null,"",null,"INC"]
[null,null,null,null,null,null,null,"",null,null,null,null,"",null,"",null,"INC"]
[null,null,null,null,null,null,null,"",null,null,null,null,"",null,"",null,"INC"]
[null,null,null,null,null,null,null,"",null,null,null,null,"",null,"",null,"INC"]
[null,null,null,null,null,null,null,"",null,null,null,null,"",null,"",null,"INC"]
[null,null,null,null,null,null,null,"",null,null,null,null,"",null,"",null,"INC"]
[null,null,null,null,null,null,null,"",null,null,null,null,"",null,"",null,"INC"]
[null,null,null,null,null,null,null,"",null,null,null,null,"",null,"",null,"INC"]
[null,null,null,null,null,null,null,"",null,null,null,null,"",null,"",null,"INC"]
[null,null,null,null,null,null,null,"",null,null,null,null,"",null,"",null,"INC"]
[null,null,null,null,null,null,null,"",null,null,null,null,"",null,"",null,"INC"]
[null,null,null,null,null,null,null,"",null,null,null,null,"",null,"",null,"INC"]
[null,null,null,null,null,null,null,"",null,null,null,null,"",null,"",null,"INC"]
[null,null,null,null,null,null,null,"",null,null,null,null,"",null,"",null,"INC"]
[null,null,null,null,null,null,null,"",null,null,null,null,"",null,"",null,"INC"]
[null,null,null,null,null,null,null,"",null,null,null,null,"",null,"",null,"INC"]
[null,null,null,null,null,null,null,"",null,null,null,null,"",null,"",null,"INC"]
[null,null,null,null,null,null,null,{"$f":"IF((C911<>\"\")*AND(F911<>\"\")*AND(G911<>\"\")*AND(M911<>\"\")*AND(N911<>\"\"), IF((SQRT(M911*C911))/N911<(G911*F911),(SQRT(M911*C911))/N911,G911*F911), \"\")","v":""},null,null,null,null,{"$f":"IF((D911<>\"\")*AND(E911<>\"\")*AND(I911<>\"\")*AND(J911<>\"\")*AND(K911<>\"\"), IF((I911<J911),D911*E911,IF(D911*E911*(1-((I911-J911)/(K911-J911)))>0,D911*E911*(1-((I911-J911)/(K911-J911))),0)), \"\")","v":""},null,{"$f":"IF((C911<>\"\")*AND(N911<>\"\")*AND(P911<>\"\"), (P911^2/C911)*N911, \"\")","v":""},null,{"$f":"IF((H911<>\"\")*AND(I911<>\"\")*AND(M911<>\"\")*AND(O911<>\"\")*AND(P911<>\"\"), IF((O911<=M911)*AND(P911<=H911)*AND(I911<=K911),\"PASS\",\"FAIL\"), \"INC\")","v":"INC"}]
[null,null,null,null,null,null,null,"",null,null,null,null,"",null,"",null,"INC"]
[null,null,null,null,null,null,null,"",null,null,null,null,"",null,"",null,"INC"]
[null,null,null,null,null,null,null,"",null,null,null,null,"",null,"",null,"INC"]
[null,null,null,null,null,null,null,"",null,null,null,null,"",null,"",null,"INC"]
[null,null,null,null,null,null,null,"",null,null,null,null,"",null,"",null,"INC"]
[null,null,null,null,null,null,null,"",null,null,null,null,"",null,"",null,"INC"]
[null,null,null,null,null,null,null,"",null,null,null,null,"",null,"",null,"INC"]
[null,null,null,null,null,null,null,"",null,null,null,null,"",null,"",null,"INC"]
[null,null,null,null,null,null,null,"",null,null,null,null,"",null,"",null,"INC"]
[null,null,null,null,null,null,null,"",null,null,null,null,"",null,"",null,"INC"]
[null,null,null,null,null,null,null,"",null,null,null,null,"",null,"",null,"INC"]
[null,null,null,null,null,null,null,"",null,null,null,null,"",null,"",null,"INC"]
[null,null,null,null,null,null,null,"",null,null,null,null,"",null,"",null,"INC"]
[null,null,null,null,null,null,null,"",null,null,null,null,"",null,"",null,"INC"]
[null,null,null,null,null,null,null,"",null,null,null,null,"",null,"",null,"INC"]
[null,null,null,null,null,null,null,"",null,null,null,null,"",null,"",null,"INC"]
[null,null,null,null,null,null,null,"",null,null,null,null,"",null,"",null,"INC"]
[null,null,null,null,null,null,null,"",null,null,null,null,"",null,"",null,"INC"]
[null,null,null,null,null,null,null,"",null,null,null,null,"",null,"",null,"INC"]
[null,null,null,null,null,null,null,"",null,null,null,null,"",null,"",null,"INC"]
[null,null,null,null,null,null,null,"",null,null,null,null,"",null,"",null,"INC"]
[null,null,null,null,null,null,null,"",null,null,null,null,"",null,"",null,"INC"]
[null,null,null,null,null,null,null,"",null,null,null,null,"",null,"",null,"INC"]
[null,null,null,null,null,null,null,"",null,null,null,null,"",null,"",null,"INC"]
[null,null,null,null,null,null,null,"",null,null,null,null,"",null,"",null,"INC"]
[null,null,null,null,null,null,null,"",null,null,null,null,"",null,"",null,"INC"]
[null,null,null,null,null,null,null,"",null,null,null,null,"",null,"",null,"INC"]
[null,null,null,null,null,null,null,"",null,null,null,null,"",null,"",null,"INC"]
[null,null,null,null,null,null,null,"",null,null,null,null,"",null,"",null,"INC"]
[null,null,null,null,null,null,null,"",null,null,null,null,"",null,"",null,"INC"]
[null,null,null,null,null,null,null,"",null,null,null,null,"",null,"",null,"INC"]
[null,null,null,null,null,null,null,"",null,null,null,null,"",null,"",null,"INC"]
[null,null,null,null,null,null,null,"",null,null,null,null,"",null,"",null,"INC"]
[null,null,null,null,null,null,null,"",null,null,null,null,"",null,"",null,"INC"]
[null,null,null,null,null,null,null,"",null,null,null,null,"",null,"",null,"INC"]
[null,null,null,null,null,null,null,"",null,null,null,null,"",null,"",null,"INC"]
[null,null,null,null,null,null,null,"",null,null,null,null,"",null,"",null,"INC"]
[null,null,null,null,null,null,null,"",null,null,null,null,"",null,"",null,"INC"]
[null,null,null,null,null,null,null,"",null,null,null,null,"",null,"",null,"INC"]
[null,null,null,null,null,null,null,"",null,null,null,null,"",null,"",null,"INC"]
[null,null,null,null,null,null,null,"",null,null,null,null,"",null,"",null,"INC"]
[null,null,null,null,null,null,null,"",null,null,null,null,"",null,"",null,"INC"]
[null,null,null,null,null,null,null,"",null,null,null,null,"",null,"",null,"INC"]
[null,null,null,null,null,null,null,"",null,null,null,null,"",null,"",null,"INC"]
[null,null,null,null,null,null,null,"",null,null,null,null,"",null,"",null,"INC"]
[null,null,null,null,null,null,null,"",null,null,null,null,"",null,"",null,"INC"]
[null,null,null,null,null,null,null,"",null,null,null,null,"",null,"",null,"INC"]
[null,null,null,null,null,null,null,"",null,null,null,null,"",null,"",null,"INC"]
[null,null,null,null,null,null,null,"",null,null,null,null,"",null,"",null,"INC"]
[null,null,null,null,null,null,null,"",null,null,null,null,"",null,"",null,"INC"]
[null,null,null,null,null,null,null,"",null,null,null,null,"",null,"",null,"INC"]
[null,null,null,null,null,null,null,"",null,null,null,null,"",null,"",null,"INC"]
[null,null,null,null,null,null,null,"",null,null,null,null,"",null,"",null,"INC"]
[null,null,null,null,null,null,null,"",null,null,null,null,"",null,"",null,"INC"]
[null,null,null,null,null,null,null,"",null,null,null,null,"",null,"",null,"INC"]
[null,null,null,null,null,null,null,"",null,null,null,null,"",null,"",null,"INC"]
[null,null,null,null,null,null,null,"",null,null,null,null,"",null,"",null,"INC"]
[null,null,null,null,null,null,null,"",null,null,null,null,"",null,"",null,"INC"]
[null,null,null,null,null,null,null,"",null,null,null,null,"",null,"",null,"INC"]
[null,null,null,null,null,null,null,"",null,null,null,null,"",null,"",null,"INC"]
[null,null,null,null,null,null,null,"",null,null,null,null,"",null,"",null,"INC"]
[null,null,null,null,null,null,null,"",null,null,null,null,"",null,"",null,"INC"]
[null,null,null,null,null,null,null,"",null,null,null,null,"",null,"",null,"INC"]
[null,null,null,null,null,null,null,{"$f":"IF((C975<>\"\")*AND(F975<>\"\")*AND(G975<>\"\")*AND(M975<>\"\")*AND(N975<>\"\"), IF((SQRT(M975*C975))/N975<(G975*F975),(SQRT(M975*C975))/N975,G975*F975), \"\")","v":""},null,null,null,null,{"$f":"IF((D975<>\"\")*AND(E975<>\"\")*AND(I975<>\"\")*AND(J975<>\"\")*AND(K975<>\"\"), IF((I975<J975),D975*E975,IF(D975*E975*(1-((I975-J975)/(K975-J975)))>0,D975*E975*(1-((I975-J975)/(K975-J975))),0)), \"\")","v":""},null,{"$f":"IF((C975<>\"\")*AND(N975<>\"\")*AND(P975<>\"\"), (P975^2/C975)*N975, \"\")","v":""},null,{"$f":"IF((H975<>\"\")*AND(I975<>\"\")*AND(M975<>\"\")*AND(O975<>\"\")*AND(P975<>\"\"), IF((O975<=M975)*AND(P975<=H975)*AND(I975<=K975),\"PASS\",\"FAIL\"), \"INC\")","v":"INC"}]
[null,null,null,null,null,null,null,"",null,null,null,null,"",null,"",null,"INC"]
[null,null,null,null,null,null,null,"",null,null,null,null,"",null,"",null,"INC"]
[null,null,null,null,null,null,null,"",null,null,null,null,"",null,"",null,"INC"]
[null,null,null,null,null,null,null,"",null,null,null,null,"",null,"",null,"INC"]
[null,null,null,null,null,null,null,"",null,null,null,null,"",null,"",null,"INC"]
[null,null,null,null,null,null,null,"",null,null,null,null,"",null,"",null,"INC"]
[null,null,null,null,null,null,null,"",null,null,null,null,"",null,"",null,"INC"]
[null,null,null,null,null,null,null,"",null,null,null,null,"",null,"",null,"INC"]
[null,null,null,null,null,null,null,"",null,null,null,null,"",null,"",null,"INC"]
[null,null,null,null,null,null,null,"",null,null,null,null,"",null,"",null,"INC"]
[null,null,null,null,null,null,null,"",null,null,null,null,"",null,"",null,"INC"]
[null,null,null,null,null,null,null,"",null,null,null,null,"",null,"",null,"INC"]
[null,null,null,null,null,null,null,"",null,null,null,null,"",null,"",null,"INC"]
[null,null,null,null,null,null,null,"",null,null,null,null,"",null,"",null,"INC"]
[null,null,null,null,null,null,null,"",null,null,null,null,"",null,"",null,"INC"]
[null,null,null,null,null,null,null,"",null,null,null,null,"",null,"",null,"INC"]
[null,null,null,null,null,null,null,"",null,null,null,null,"",null,"",null,"INC"]
[null,null,null,null,null,null,null,"",null,null,null,null,"",null,"",null,"INC"]
[null,null,null,null,null,null,null,"",null,null,null,null,"",null,"",null,"INC"]
[null,null,null,null,null,null,null,"",null,null,null,null,"",null,"",null,"INC"]
[null,null,null,null,null,null,null,"",null,null,null,null,"",null,"",null,"INC"]
[null,null,null,null,null,null,null,"",null,null,null,null,"",null,"",null,"INC"]
[null,null,null,null,null,null,null,"",null,null,null,null,"",null,"",null,"INC"]
[null,null,null,null,null,null,null,"",null,null,null,null,"",null,"",null,"INC"]
[null,null,null,null,null,null,null,"",null,null,null,null,"",null,"",null,"INC"]
[null,null,null,null,null,null,null,"",null,null,null,null,"",null,"",null,"INC"]
[null,null,null,null,null,null,null,"",null,null,null,null,"",null,"",null,"INC"]
[null,null,null,null,null,null,null,"",null,null,null,null,"",null,"",null,"INC"]
[null,null,null,null,null,null,null,"",null,null,null,null,"",null,"",null,"INC"]
[null,null,null,null,null,null,null,"",null,null,null,null,"",null,"",null,"INC"]
[null,null,null,null,null,null,null,"",null,null,null,null,"",null,"",null,"INC"]
[null,null,null,null,null,null,null,"",null,null,null,null,"",null,"",null,"INC"]
[null,null,null,null,null,null,null,"",null,null,null,null,"",null,"",null,"INC"]
[null,null,null,null,null,null,null,"",null,null,null,null,"",null,"",null,"INC"]
[null,null,null,null,null,null,null,"",null,null,null,null,"",null,"",null,"INC"]
[null,null,null,null,null,null,null,"",null,null,null,null,"",null,"",null,"INC"]
[null,null,null,null,null,null,null,"",null,null,null,null,"",null,"",null,"INC"]
[null,null,null,null,null,null,null,"",null,null,null,null,"",null,"",null,"INC"]
[null,null,null,null,null,null,null,"",null,null,null,null,"",null,"",null,"INC"]
[null,null,null,null,null,null,null,"",null,null,null,null,"",null,"",null,"INC"]
[null,null,null,null,null,null,null,"",null,null,null,null,"",null,"",null,"INC"]
[null,null,null,null,null,null,null,"",null,null,null,null,"",null,"",null,"INC"]
[null,null,null,null,null,null,null,"",null,null,null,null,"",null,"",null,"INC"]
[null,null,null,null,null,null,null,"",null,null,null,null,"",null,"",null,"INC"]
[null,null,null,null,null,null,null,"",null,null,null,null,"",null,"",null,"INC"]
[null,null,null,null,null,null,null,"",null,null,null,null,"",null,"",null,"INC"]
[null,null,null,null,null,null,null,"",null,null,null,null,"",null,"",null,"INC"]
[null,null,null,null,null,null,null,"",null,null,null,null,"",null,"",null,"INC"]
[null,null,null,null,null,null,null,"",null,null,null,null,"",null,"",null,"INC"]
[null,null,null,null,null,null,null,"",null,null,null,null,"",null,"",null,"INC"]
[null,null,null,null,null,null,null,"",null,null,null,null,"",null,"",null,"INC"]
[null,null,null,null,null,null,null,"",null,null,null,null,"",null,"",null,"INC"]
[null,null,null,null,null,null,null,"",null,null,null,null,"",null,"",null,"INC"]
[null,null,null,null,null,null,null,"",null,null,null,null,"",null,"",null,"INC"]
[null,null,null,null,null,null,null,"",null,null,null,null,"",null,"",null,"INC"]
[null,null,null,null,null,null,null,"",null,null,null,null,"",null,"",null,"INC"]
[null,null,null,null,null,null,null,"",null,null,null,null,"",null,"",null,"INC"]
[null,null,null,null,null,null,null,"",null,null,null,null,"",null,"",null,"INC"]
[null,null,null,null,null,null,null,"",null,null,null,null,"",null,"",null,"INC"]
[null,null,null,null,null,null,null,"",null,null,null,null,"",null,"",null,"INC"]
[null,null,null,null,null,null,null,"",null,null,null,null,"",null,"",null,"INC"]
[null,null,null,null,null,null,null,"",null,null,null,null,"",null,"",null,"INC"]
[null,null,null,null,null,null,null,"",null,null,null,null,"",null,"",null,"INC"]
[null,null,null,null,null,null,null,{"$f":"IF((C1039<>\"\")*AND(F1039<>\"\")*AND(G1039<>\"\")*AND(M1039<>\"\")*AND(N1039<>\"\"), IF((SQRT(M1039*C1039))/N1039<(G1039*F1039),(SQRT(M1039*C1039))/N1039,G1039*F1039), \"\")","v":""},null,null,null,null,{"$f":"IF((D1039<>\"\")*AND(E1039<>\"\")*AND(I1039<>\"\")*AND(J1039<>\"\")*AND(K1039<>\"\"), IF((I1039<J1039),D1039*E1039,IF(D1039*E1039*(1-((I1039-J1039)/(K1039-J1039)))>0,D1039*E1039*(1-((I1039-J1039)/(K1039-J1039))),0)), \"\")","v":""},null,{"$f":"IF((C1039<>\"\")*AND(N1039<>\"\")*AND(P1039<>\"\"), (P1039^2/C1039)*N1039, \"\")","v":""},null,{"$f":"IF((H1039<>\"\")*AND(I1039<>\"\")*AND(M1039<>\"\")*AND(O1039<>\"\")*AND(P1039<>\"\"), IF((O1039<=M1039)*AND(P1039<=H1039)*AND(I1039<=K1039),\"PASS\",\"FAIL\"), \"INC\")","v":"INC"}]
[null,null,null,null,null,null,null,"",null,null,null,null,"",null,"",null,"INC"]
[null,null,null,null,null,null,null,"",null,null,null,null,"",null,"",null,"INC"]
[null,null,null,null,null,null,null,"",null,null,null,null,"",null,"",null,"INC"]
[null,null,null,null,null,null,null,"",null,null,null,null,"",null,"",null,"INC"]
[null,null,null,null,null,null,null,"",null,null,null,null,"",null,"",null,"INC"]
[null,null,null,null,null,null,null,"",null,null,null,null,"",null,"",null,"INC"]
[null,null,null,null,null,null,null,"",null,null,null,null,"",null,"",null,"INC"]
[null,null,null,null,null,null,null,"",null,null,null,null,"",null,"",null,"INC"]
[null,null,null,null,null,null,null,"",null,null,null,null,"",null,"",null,"INC"]
[null,null,null,null,null,null,null,"",null,null,null,null,"",null,"",null,"INC"]
[null,null,null,null,null,null,null,"",null,null,null,null,"",null,"",null,"INC"]
[null,null,null,null,null,null,null,"",null,null,null,null,"",null,"",null,"INC"]
[null,null,null,null,null,null,null,"",null,null,null,null,"",null,"",null,"INC"]
[null,null,null,null,null,null,null,"",null,null,null,null,"",null,"",null,"INC"]
[null,null,null,null,null,null,null,"",null,null,null,null,"",null,"",null,"INC"]
[null,null,null,null,null,null,null,"",null,null,null,null,"",null,"",null,"INC"]
[null,null,null,null,null,null,null,"",null,null,null,null,"",null,"",null,"INC"]
[null,null,null,null,null,null,null,"",null,null,null,null,"",null,"",null,"INC"]
[null,null,null,null,null,null,null,"",null,null,null,null,"",null,"",null,"INC"]
[null,null,null,null,null,null,null,"",null,null,null,null,"",null,"",null,"INC"]
[null,null,null,null,null,null,null,"",null,null,null,null,"",null,"",null,"INC"]
[null,null,null,null,null,null,null,"",null,null,null,null,"",null,"",null,"INC"]
[null,null,null,null,null,null,null,"",null,null,null,null,"",null,"",null,"INC"]
[null,null,null,null,null,null,null,"",null,null,null,null,"",null,"",null,"INC"]

{"sheet":"General Purpose Diodes","index":9,"n_rows":257,"n_cols":20,"rows_kept":257,"cut":false,"hidden":false,"merged":[[7,15,7,16]]}
["Diode Derating Worksheet (reference GSFC Document EEE-INST-002, Section S1, Table 4)",null,null,null,null,null,null,null,null,"CUI//SP-EXPT"]
[]
[null,"Notes:"]
[null,"1) Do not exceed Tj=125 °C or 40 °C below the manufacturer's maximum rating, whichever is lower."]
[]
["General Purpose, Switching, Pin/Schottky, and Thyristors Diodes"]
[]
[null,null,"COMPONENT SPECIFICATION SECTION",null,null,null,null,null,null,null,null,null,null,null,null,"DERATING SECTION"]
["Component","Ref. Des.","Operating Rated PIV","PIV Derating Factor","Operating Rated Surge Current","Surge Current Derating Factor","Operating Rated Forward Current","Forward Current Derating Factor","Maximum Junction Temperature","Junction Temp Derating Factor","GSFC Derated PIV Rqmt","Actual Operating PIV","GSFC Derated Surge Current Rqmt","Actual Operating Surge Current","GSFC Derated Forward Current Rqmt","Actual Operating Forward Current","GSFC Derated Junction Temperature Requirement","Actual Operating Junction Temp","Pass/Fail","REMARKS"]
[null,null,null,{"$f":"IF(C10<>\"\", 0.7, \"\")","v":""},null,{"$f":"IF(E10<>\"\", 0.5, \"\")","v":""},null,{"$f":"IF(G10<>\"\", 0.5, \"\")","v":""},null,{"$f":"IF(I10<>\"\", 0.8, \"\")","v":""},{"$f":"IF(C10<>\"\", C10*D10, \"\")","v":""},null,{"$f":"IF(E10<>\"\", E10*F10, \"\")","v":""},null,{"$f":"IF(G10<>\"\", G10*H10, \"\")","v":""},null,{"$f":"IF(I10=\"\", \"\", MIN(I10*J10,125,I10-40))","v":""},null,{"$f":"IF((K10<>\"\")*AND(L10<>\"\")*AND(M10<>\"\")*AND(N10<>\"\")*AND(O10<>\"\")*AND(P10<>\"\")*AND(Q10<>\"\")*AND(R10<>\"\"), IF((L10<=K10)*AND(N10<=M10)*AND(P10<=O10)*AND(R10<=Q10),\"PASS\",\"FAIL\"), \"INC\")","v":"INC"}]
[null,null,null,"",null,"",null,"",null,"","",null,"",null,"",null,"",null,"INC"]
[null,null,null,"",null,"",null,"",null,"","",null,"",null,"",null,"",null,"INC"]
[null,null,null,"",null,"",null,"",null,"","",null,"",null,"",null,"",null,"INC"]
[null,null,null,"",null,"",null,"",null,"","",null,"",null,"",null,"",null,"INC"]
[null,null,null,"",null,"",null,"",null,"","",null,"",null,"",null,"",null,"INC"]
[null,null,null,"",null,"",null,"",null,"","",null,"",null,"",null,"",null,"INC"]
[null,null,null,"",null,"",null,"",null,"","",null,"",null,"",null,"",null,"INC"]
[null,null,null,"",null,"",null,"",null,"","",null,"",null,"",null,"",null,"INC"]
[null,null,null,"",null,"",null,"",null,"","",null,"",null,"",null,"",null,"INC"]
[null,null,null,"",null,"",null,"",null,"","",null,"",null,"",null,"",null,"INC"]
[null,null,null,"",null,"",null,"",null,"","",null,"",null,"",null,"",null,"INC"]
[null,null,null,"",null,"",null,"",null,"","",null,"",null,"",null,"",null,"INC"]
[null,null,null,"",null,"",null,"",null,"","",null,"",null,"",null,"",null,"INC"]
[null,null,null,"",null,"",null,"",null,"","",null,"",null,"",null,"",null,"INC"]
[null,null,null,"",null,"",null,"",null,"","",null,"",null,"",null,"",null,"INC"]
[null,null,null,"",null,"",null,"",null,"","",null,"",null,"",null,"",null,"INC"]
[null,null,null,"",null,"",null,"",null,"","",null,"",null,"",null,"",null,"INC"]
[null,null,null,"",null,"",null,"",null,"","",null,"",null,"",null,"",null,"INC"]
[null,null,null,"",null,"",null,"",null,"","",null,"",null,"",null,"",null,"INC"]
[null,null,null,"",null,"",null,"",null,"","",null,"",null,"",null,"",null,"INC"]
[null,null,null,"",null,"",null,"",null,"","",null,"",null,"",null,"",null,"INC"]
[null,null,null,"",null,"",null,"",null,"","",null,"",null,"",null,"",null,"INC"]
[null,null,null,"",null,"",null,"",null,"","",null,"",null,"",null,"",null,"INC"]
[null,null,null,"",null,"",null,"",null,"","",null,"",null,"",null,"",null,"INC"]
[null,null,null,"",null,"",null,"",null,"","",null,"",null,"",null,"",null,"INC"]
[null,null,null,"",null,"",null,"",null,"","",null,"",null,"",null,"",null,"INC"]
[null,null,null,"",null,"",null,"",null,"","",null,"",null,"",null,"",null,"INC"]
[null,null,null,"",null,"",null,"",null,"","",null,"",null,"",null,"",null,"INC"]
[null,null,null,"",null,"",null,"",null,"","",null,"",null,"",null,"",null,"INC"]
[null,null,null,"",null,"",null,"",null,"","",null,"",null,"",null,"",null,"INC"]
[null,null,null,"",null,"",null,"",null,"","",null,"",null,"",null,"",null,"INC"]
[null,null,null,"",null,"",null,"",null,"","",null,"",null,"",null,"",null,"INC"]
[null,null,null,"",null,"",null,"",null,"","",null,"",null,"",null,"",null,"INC"]
[null,null,null,"",null,"",null,"",null,"","",null,"",null,"",null,"",null,"INC"]
[null,null,null,"",null,"",null,"",null,"","",null,"",null,"",null,"",null,"INC"]
[null,null,null,"",null,"",null,"",null,"","",null,"",null,"",null,"",null,"INC"]
[null,null,null,"",null,"",null,"",null,"","",null,"",null,"",null,"",null,"INC"]
[null,null,null,"",null,"",null,"",null,"","",null,"",null,"",null,"",null,"INC"]
[null,null,null,"",null,"",null,"",null,"","",null,"",null,"",null,"",null,"INC"]
[null,null,null,"",null,"",null,"",null,"","",null,"",null,"",null,"",null,"INC"]
[null,null,null,"",null,"",null,"",null,"","",null,"",null,"",null,"",null,"INC"]
[null,null,null,"",null,"",null,"",null,"","",null,"",null,"",null,"",null,"INC"]
[null,null,null,"",null,"",null,"",null,"","",null,"",null,"",null,"",null,"INC"]
[null,null,null,"",null,"",null,"",null,"","",null,"",null,"",null,"",null,"INC"]
[null,null,null,"",null,"",null,"",null,"","",null,"",null,"",null,"",null,"INC"]
[null,null,null,"",null,"",null,"",null,"","",null,"",null,"",null,"",null,"INC"]
[null,null,null,"",null,"",null,"",null,"","",null,"",null,"",null,"",null,"INC"]
[null,null,null,"",null,"",null,"",null,"","",null,"",null,"",null,"",null,"INC"]
[null,null,null,"",null,"",null,"",null,"","",null,"",null,"",null,"",null,"INC"]
[null,null,null,"",null,"",null,"",null,"","",null,"",null,"",null,"",null,"INC"]
[null,null,null,"",null,"",null,"",null,"","",null,"",null,"",null,"",null,"INC"]
[null,null,null,"",null,"",null,"",null,"","",null,"",null,"",null,"",null,"INC"]
[null,null,null,"",null,"",null,"",null,"","",null,"",null,"",null,"",null,"INC"]
[null,null,null,"",null,"",null,"",null,"","",null,"",null,"",null,"",null,"INC"]
[null,null,null,"",null,"",null,"",null,"","",null,"",null,"",null,"",null,"INC"]
[null,null,null,"",null,"",null,"",null,"","",null,"",null,"",null,"",null,"INC"]
[null,null,null,"",null,"",null,"",null,"","",null,"",null,"",null,"",null,"INC"]
[null,null,null,"",null,"",null,"",null,"","",null,"",null,"",null,"",null,"INC"]
[null,null,null,"",null,"",null,"",null,"","",null,"",null,"",null,"",null,"INC"]
[null,null,null,"",null,"",null,"",null,"","",null,"",null,"",null,"",null,"INC"]
[null,null,null,"",null,"",null,"",null,"","",null,"",null,"",null,"",null,"INC"]
[null,null,null,"",null,"",null,"",null,"","",null,"",null,"",null,"",null,"INC"]
[null,null,null,"",null,"",null,"",null,"","",null,"",null,"",null,"",null,"INC"]
[null,null,null,{"$f":"IF(C74<>\"\", 0.7, \"\")","v":""},null,{"$f":"IF(E74<>\"\", 0.5, \"\")","v":""},null,{"$f":"IF(G74<>\"\", 0.5, \"\")","v":""},null,{"$f":"IF(I74<>\"\", 0.8, \"\")","v":""},{"$f":"IF(C74<>\"\", C74*D74, \"\")","v":""},null,{"$f":"IF(E74<>\"\", E74*F74, \"\")","v":""},null,{"$f":"IF(G74<>\"\", G74*H74, \"\")","v":""},null,{"$f":"IF(I74=\"\", \"\", MIN(I74*J74,125,I74-40))","v":""},null,{"$f":"IF((K74<>\"\")*AND(L74<>\"\")*AND(M74<>\"\")*AND(N74<>\"\")*AND(O74<>\"\")*AND(P74<>\"\")*AND(Q74<>\"\")*AND(R74<>\"\"), IF((L74<=K74)*AND(N74<=M74)*AND(P74<=O74)*AND(R74<=Q74),\"PASS\",\"FAIL\"), \"INC\")","v":"INC"}]
[null,null,null,"",null,"",null,"",null,"","",null,"",null,"",null,"",null,"INC"]
[null,null,null,"",null,"",null,"",null,"","",null,"",null,"",null,"",null,"INC"]
[null,null,null,"",null,"",null,"",null,"","",null,"",null,"",null,"",null,"INC"]
[null,null,null,"",null,"",null,"",null,"","",null,"",null,"",null,"",null,"INC"]
[null,null,null,"",null,"",null,"",null,"","",null,"",null,"",null,"",null,"INC"]
[null,null,null,"",null,"",null,"",null,"","",null,"",null,"",null,"",null,"INC"]
[null,null,null,"",null,"",null,"",null,"","",null,"",null,"",null,"",null,"INC"]
[null,null,null,"",null,"",null,"",null,"","",null,"",null,"",null,"",null,"INC"]
[null,null,null,"",null,"",null,"",null,"","",null,"",null,"",null,"",null,"INC"]
[null,null,null,"",null,"",null,"",null,"","",null,"",null,"",null,"",null,"INC"]
[null,null,null,"",null,"",null,"",null,"","",null,"",null,"",null,"",null,"INC"]
[null,null,null,"",null,"",null,"",null,"","",null,"",null,"",null,"",null,"INC"]
[null,null,null,"",null,"",null,"",null,"","",null,"",null,"",null,"",null,"INC"]
[null,null,null,"",null,"",null,"",null,"","",null,"",null,"",null,"",null,"INC"]
[null,null,null,"",null,"",null,"",null,"","",null,"",null,"",null,"",null,"INC"]
[null,null,null,"",null,"",null,"",null,"","",null,"",null,"",null,"",null,"INC"]
[null,null,null,"",null,"",null,"",null,"","",null,"",null,"",null,"",null,"INC"]
[null,null,null,"",null,"",null,"",null,"","",null,"",null,"",null,"",null,"INC"]
[null,null,null,"",null,"",null,"",null,"","",null,"",null,"",null,"",null,"INC"]
[null,null,null,"",null,"",null,"",null,"","",null,"",null,"",null,"",null,"INC"]
[null,null,null,"",null,"",null,"",null,"","",null,"",null,"",null,"",null,"INC"]
[null,null,null,"",null,"",null,"",null,"","",null,"",null,"",null,"",null,"INC"]
[null,null,null,"",null,"",null,"",null,"","",null,"",null,"",null,"",null,"INC"]
[null,null,null,"",null,"",null,"",null,"","",null,"",null,"",null,"",null,"INC"]
[null,null,null,"",null,"",null,"",null,"","",null,"",null,"",null,"",null,"INC"]
[null,null,null,"",null,"",null,"",null,"","",null,"",null,"",null,"",null,"INC"]
[null,null,null,"",null,"",null,"",null,"","",null,"",null,"",null,"",null,"INC"]
[null,null,null,"",null,"",null,"",null,"","",null,"",null,"",null,"",null,"INC"]
[null,null,null,"",null,"",null,"",null,"","",null,"",null,"",null,"",null,"INC"]
[null,null,null,"",null,"",null,"",null,"","",null,"",null,"",null,"",null,"INC"]
[null,null,null,"",null,"",null,"",null,"","",null,"",null,"",null,"",null,"INC"]
[null,null,null,"",null,"",null,"",null,"","",null,"",null,"",null,"",null,"INC"]
[null,null,null,"",null,"",null,"",null,"","",null,"",null,"",null,"",null,"INC"]
[null,null,null,"",null,"",null,"",null,"","",null,"",null,"",null,"",null,"INC"]
[null,null,null,"",null,"",null,"",null,"","",null,"",null,"",null,"",null,"INC"]
[null,null,null,"",null,"",null,"",null,"","",null,"",null,"",null,"",null,"INC"]
[null,null,null,"",null,"",null,"",null,"","",null,"",null,"",null,"",null,"INC"]
[null,null,null,"",null,"",null,"",null,"","",null,"",null,"",null,"",null,"INC"]
[null,null,null,"",null,"",null,"",null,"","",null,"",null,"",null,"",null,"INC"]
[null,null,null,"",null,"",null,"",null,"","",null,"",null,"",null,"",null,"INC"]
[null,null,null,"",null,"",null,"",null,"","",null,"",null,"",null,"",null,"INC"]
[null,null,null,"",null,"",null,"",null,"","",null,"",null,"",null,"",null,"INC"]
[null,null,null,"",null,"",null,"",null,"","",null,"",null,"",null,"",null,"INC"]
[null,null,null,"",null,"",null,"",null,"","",null,"",null,"",null,"",null,"INC"]
[null,null,null,"",null,"",null,"",null,"","",null,"",null,"",null,"",null,"INC"]
[null,null,null,"",null,"",null,"",null,"","",null,"",null,"",null,"",null,"INC"]
[null,null,null,"",null,"",null,"",null,"","",null,"",null,"",null,"",null,"INC"]
[null,null,null,"",null,"",null,"",null,"","",null,"",null,"",null,"",null,"INC"]
[null,null,null,"",null,"",null,"",null,"","",null,"",null,"",null,"",null,"INC"]
[null,null,null,"",null,"",null,"",null,"","",null,"",null,"",null,"",null,"INC"]
[null,null,null,"",null,"",null,"",null,"","",null,"",null,"",null,"",null,"INC"]
[null,null,null,"",null,"",null,"",null,"","",null,"",null,"",null,"",null,"INC"]
[null,null,null,"",null,"",null,"",null,"","",null,"",null,"",null,"",null,"INC"]
[null,null,null,"",null,"",null,"",null,"","",null,"",null,"",null,"",null,"INC"]
[null,null,null,"",null,"",null,"",null,"","",null,"",null,"",null,"",null,"INC"]
[null,null,null,"",null,"",null,"",null,"","",null,"",null,"",null,"",null,"INC"]
[null,null,null,"",null,"",null,"",null,"","",null,"",null,"",null,"",null,"INC"]
[null,null,null,"",null,"",null,"",null,"","",null,"",null,"",null,"",null,"INC"]
[null,null,null,"",null,"",null,"",null,"","",null,"",null,"",null,"",null,"INC"]
[null,null,null,"",null,"",null,"",null,"","",null,"",null,"",null,"",null,"INC"]
[null,null,null,"",null,"",null,"",null,"","",null,"",null,"",null,"",null,"INC"]
[null,null,null,"",null,"",null,"",null,"","",null,"",null,"",null,"",null,"INC"]
[null,null,null,"",null,"",null,"",null,"","",null,"",null,"",null,"",null,"INC"]
[null,null,null,{"$f":"IF(C138<>\"\", 0.7, \"\")","v":""},null,{"$f":"IF(E138<>\"\", 0.5, \"\")","v":""},null,{"$f":"IF(G138<>\"\", 0.5, \"\")","v":""},null,{"$f":"IF(I138<>\"\", 0.8, \"\")","v":""},{"$f":"IF(C138<>\"\", C138*D138, \"\")","v":""},null,{"$f":"IF(E138<>\"\", E138*F138, \"\")","v":""},null,{"$f":"IF(G138<>\"\", G138*H138, \"\")","v":""},null,{"$f":"IF(I138=\"\", \"\", MIN(I138*J138,125,I138-40))","v":""},null,{"$f":"IF((K138<>\"\")*AND(L138<>\"\")*AND(M138<>\"\")*AND(N138<>\"\")*AND(O138<>\"\")*AND(P138<>\"\")*AND(Q138<>\"\")*AND(R138<>\"\"), IF((L138<=K138)*AND(N138<=M138)*AND(P138<=O138)*AND(R138<=Q138),\"PASS\",\"FAIL\"), \"INC\")","v":"INC"}]
[null,null,null,"",null,"",null,"",null,"","",null,"",null,"",null,"",null,"INC"]
[null,null,null,"",null,"",null,"",null,"","",null,"",null,"",null,"",null,"INC"]
[null,null,null,"",null,"",null,"",null,"","",null,"",null,"",null,"",null,"INC"]
[null,null,null,"",null,"",null,"",null,"","",null,"",null,"",null,"",null,"INC"]
[null,null,null,"",null,"",null,"",null,"","",null,"",null,"",null,"",null,"INC"]
[null,null,null,"",null,"",null,"",null,"","",null,"",null,"",null,"",null,"INC"]
[null,null,null,"",null,"",null,"",null,"","",null,"",null,"",null,"",null,"INC"]
[null,null,null,"",null,"",null,"",null,"","",null,"",null,"",null,"",null,"INC"]
[null,null,null,"",null,"",null,"",null,"","",null,"",null,"",null,"",null,"INC"]
[null,null,null,"",null,"",null,"",null,"","",null,"",null,"",null,"",null,"INC"]
[null,null,null,"",null,"",null,"",null,"","",null,"",null,"",null,"",null,"INC"]
[null,null,null,"",null,"",null,"",null,"","",null,"",null,"",null,"",null,"INC"]
[null,null,null,"",null,"",null,"",null,"","",null,"",null,"",null,"",null,"INC"]
[null,null,null,"",null,"",null,"",null,"","",null,"",null,"",null,"",null,"INC"]
[null,null,null,"",null,"",null,"",null,"","",null,"",null,"",null,"",null,"INC"]
[null,null,null,"",null,"",null,"",null,"","",null,"",null,"",null,"",null,"INC"]
[null,null,null,"",null,"",null,"",null,"","",null,"",null,"",null,"",null,"INC"]
[null,null,null,"",null,"",null,"",null,"","",null,"",null,"",null,"",null,"INC"]
[null,null,null,"",null,"",null,"",null,"","",null,"",null,"",null,"",null,"INC"]
[null,null,null,"",null,"",null,"",null,"","",null,"",null,"",null,"",null,"INC"]
[null,null,null,"",null,"",null,"",null,"","",null,"",null,"",null,"",null,"INC"]
[null,null,null,"",null,"",null,"",null,"","",null,"",null,"",null,"",null,"INC"]
[null,null,null,"",null,"",null,"",null,"","",null,"",null,"",null,"",null,"INC"]
[null,null,null,"",null,"",null,"",null,"","",null,"",null,"",null,"",null,"INC"]
[null,null,null,"",null,"",null,"",null,"","",null,"",null,"",null,"",null,"INC"]
[null,null,null,"",null,"",null,"",null,"","",null,"",null,"",null,"",null,"INC"]
[null,null,null,"",null,"",null,"",null,"","",null,"",null,"",null,"",null,"INC"]
[null,null,null,"",null,"",null,"",null,"","",null,"",null,"",null,"",null,"INC"]
[null,null,null,"",null,"",null,"",null,"","",null,"",null,"",null,"",null,"INC"]
[null,null,null,"",null,"",null,"",null,"","",null,"",null,"",null,"",null,"INC"]
[null,null,null,"",null,"",null,"",null,"","",null,"",null,"",null,"",null,"INC"]
[null,null,null,"",null,"",null,"",null,"","",null,"",null,"",null,"",null,"INC"]
[null,null,null,"",null,"",null,"",null,"","",null,"",null,"",null,"",null,"INC"]
[null,null,null,"",null,"",null,"",null,"","",null,"",null,"",null,"",null,"INC"]
[null,null,null,"",null,"",null,"",null,"","",null,"",null,"",null,"",null,"INC"]
[null,null,null,"",null,"",null,"",null,"","",null,"",null,"",null,"",null,"INC"]
[null,null,null,"",null,"",null,"",null,"","",null,"",null,"",null,"",null,"INC"]
[null,null,null,"",null,"",null,"",null,"","",null,"",null,"",null,"",null,"INC"]
[null,null,null,"",null,"",null,"",null,"","",null,"",null,"",null,"",null,"INC"]
[null,null,null,"",null,"",null,"",null,"","",null,"",null,"",null,"",null,"INC"]
[null,null,null,"",null,"",null,"",null,"","",null,"",null,"",null,"",null,"INC"]
[null,null,null,"",null,"",null,"",null,"","",null,"",null,"",null,"",null,"INC"]
[null,null,null,"",null,"",null,"",null,"","",null,"",null,"",null,"",null,"INC"]
[null,null,null,"",null,"",null,"",null,"","",null,"",null,"",null,"",null,"INC"]
[null,null,null,"",null,"",null,"",null,"","",null,"",null,"",null,"",null,"INC"]
[null,null,null,"",null,"",null,"",null,"","",null,"",null,"",null,"",null,"INC"]
[null,null,null,"",null,"",null,"",null,"","",null,"",null,"",null,"",null,"INC"]
[null,null,null,"",null,"",null,"",null,"","",null,"",null,"",null,"",null,"INC"]
[null,null,null,"",null,"",null,"",null,"","",null,"",null,"",null,"",null,"INC"]
[null,null,null,"",null,"",null,"",null,"","",null,"",null,"",null,"",null,"INC"]
[null,null,null,"",null,"",null,"",null,"","",null,"",null,"",null,"",null,"INC"]
[null,null,null,"",null,"",null,"",null,"","",null,"",null,"",null,"",null,"INC"]
[null,null,null,"",null,"",null,"",null,"","",null,"",null,"",null,"",null,"INC"]
[null,null,null,"",null,"",null,"",null,"","",null,"",null,"",null,"",null,"INC"]
[null,null,null,"",null,"",null,"",null,"","",null,"",null,"",null,"",null,"INC"]
[null,null,null,"",null,"",null,"",null,"","",null,"",null,"",null,"",null,"INC"]
[null,null,null,"",null,"",null,"",null,"","",null,"",null,"",null,"",null,"INC"]
[null,null,null,"",null,"",null,"",null,"","",null,"",null,"",null,"",null,"INC"]
[null,null,null,"",null,"",null,"",null,"","",null,"",null,"",null,"",null,"INC"]
[null,null,null,"",null,"",null,"",null,"","",null,"",null,"",null,"",null,"INC"]
[null,null,null,"",null,"",null,"",null,"","",null,"",null,"",null,"",null,"INC"]
[null,null,null,"",null,"",null,"",null,"","",null,"",null,"",null,"",null,"INC"]
[null,null,null,"",null,"",null,"",null,"","",null,"",null,"",null,"",null,"INC"]
[null,null,null,{"$f":"IF(C202<>\"\", 0.7, \"\")","v":""},null,{"$f":"IF(E202<>\"\", 0.5, \"\")","v":""},null,{"$f":"IF(G202<>\"\", 0.5, \"\")","v":""},null,{"$f":"IF(I202<>\"\", 0.8, \"\")","v":""},{"$f":"IF(C202<>\"\", C202*D202, \"\")","v":""},null,{"$f":"IF(E202<>\"\", E202*F202, \"\")","v":""},null,{"$f":"IF(G202<>\"\", G202*H202, \"\")","v":""},null,{"$f":"IF(I202=\"\", \"\", MIN(I202*J202,125,I202-40))","v":""},null,{"$f":"IF((K202<>\"\")*AND(L202<>\"\")*AND(M202<>\"\")*AND(N202<>\"\")*AND(O202<>\"\")*AND(P202<>\"\")*AND(Q202<>\"\")*AND(R202<>\"\"), IF((L202<=K202)*AND(N202<=M202)*AND(P202<=O202)*AND(R202<=Q202),\"PASS\",\"FAIL\"), \"INC\")","v":"INC"}]
[null,null,null,"",null,"",null,"",null,"","",null,"",null,"",null,"",null,"INC"]
[null,null,null,"",null,"",null,"",null,"","",null,"",null,"",null,"",null,"INC"]
[null,null,null,"",null,"",null,"",null,"","",null,"",null,"",null,"",null,"INC"]
[null,null,null,"",null,"",null,"",null,"","",null,"",null,"",null,"",null,"INC"]
[null,null,null,"",null,"",null,"",null,"","",null,"",null,"",null,"",null,"INC"]
[null,null,null,"",null,"",null,"",null,"","",null,"",null,"",null,"",null,"INC"]
[null,null,null,"",null,"",null,"",null,"","",null,"",null,"",null,"",null,"INC"]
[null,null,null,"",null,"",null,"",null,"","",null,"",null,"",null,"",null,"INC"]
[null,null,null,"",null,"",null,"",null,"","",null,"",null,"",null,"",null,"INC"]
[null,null,null,"",null,"",null,"",null,"","",null,"",null,"",null,"",null,"INC"]
[null,null,null,"",null,"",null,"",null,"","",null,"",null,"",null,"",null,"INC"]
[null,null,null,"",null,"",null,"",null,"","",null,"",null,"",null,"",null,"INC"]
[null,null,null,"",null,"",null,"",null,"","",null,"",null,"",null,"",null,"INC"]
[null,null,null,"",null,"",null,"",null,"","",null,"",null,"",null,"",null,"INC"]
[null,null,null,"",null,"",null,"",null,"","",null,"",null,"",null,"",null,"INC"]
[null,null,null,"",null,"",null,"",null,"","",null,"",null,"",null,"",null,"INC"]
[null,null,null,"",null,"",null,"",null,"","",null,"",null,"",null,"",null,"INC"]
[null,null,null,"",null,"",null,"",null,"","",null,"",null,"",null,"",null,"INC"]
[null,null,null,"",null,"",null,"",null,"","",null,"",null,"",null,"",null,"INC"]
[null,null,null,"",null,"",null,"",null,"","",null,"",null,"",null,"",null,"INC"]
[null,null,null,"",null,"",null,"",null,"","",null,"",null,"",null,"",null,"INC"]
[null,null,null,"",null,"",null,"",null,"","",null,"",null,"",null,"",null,"INC"]
[null,null,null,"",null,"",null,"",null,"","",null,"",null,"",null,"",null,"INC"]
[null,null,null,"",null,"",null,"",null,"","",null,"",null,"",null,"",null,"INC"]
[null,null,null,"",null,"",null,"",null,"","",null,"",null,"",null,"",null,"INC"]
[null,null,null,"",null,"",null,"",null,"","",null,"",null,"",null,"",null,"INC"]
[null,null,null,"",null,"",null,"",null,"","",null,"",null,"",null,"",null,"INC"]
[null,null,null,"",null,"",null,"",null,"","",null,"",null,"",null,"",null,"INC"]
[null,null,null,"",null,"",null,"",null,"","",null,"",null,"",null,"",null,"INC"]
[null,null,null,"",null,"",null,"",null,"","",null,"",null,"",null,"",null,"INC"]
[null,null,null,"",null,"",null,"",null,"","",null,"",null,"",null,"",null,"INC"]
[null,null,null,"",null,"",null,"",null,"","",null,"",null,"",null,"",null,"INC"]
[null,null,null,"",null,"",null,"",null,"","",null,"",null,"",null,"",null,"INC"]
[null,null,null,"",null,"",null,"",null,"","",null,"",null,"",null,"",null,"INC"]
[null,null,null,"",null,"",null,"",null,"","",null,"",null,"",null,"",null,"INC"]
[null,null,null,"",null,"",null,"",null,"","",null,"",null,"",null,"",null,"INC"]
[null,null,null,"",null,"",null,"",null,"","",null,"",null,"",null,"",null,"INC"]
[null,null,null,"",null,"",null,"",null,"","",null,"",null,"",null,"",null,"INC"]
[null,null,null,"",null,"",null,"",null,"","",null,"",null,"",null,"",null,"INC"]
[null,null,null,"",null,"",null,"",null,"","",null,"",null,"",null,"",null,"INC"]
[null,null,null,"",null,"",null,"",null,"","",null,"",null,"",null,"",null,"INC"]
[null,null,null,"",null,"",null,"",null,"","",null,"",null,"",null,"",null,"INC"]
[null,null,null,"",null,"",null,"",null,"","",null,"",null,"",null,"",null,"INC"]
[null,null,null,"",null,"",null,"",null,"","",null,"",null,"",null,"",null,"INC"]
[null,null,null,"",null,"",null,"",null,"","",null,"",null,"",null,"",null,"INC"]
[null,null,null,"",null,"",null,"",null,"","",null,"",null,"",null,"",null,"INC"]
[null,null,null,"",null,"",null,"",null,"","",null,"",null,"",null,"",null,"INC"]
[null,null,null,"",null,"",null,"",null,"","",null,"",null,"",null,"",null,"INC"]
[null,null,null,"",null,"",null,"",null,"","",null,"",null,"",null,"",null,"INC"]
[null,null,null,"",null,"",null,"",null,"","",null,"",null,"",null,"",null,"INC"]
[null,null,null,"",null,"",null,"",null,"","",null,"",null,"",null,"",null,"INC"]
[null,null,null,"",null,"",null,"",null,"","",null,"",null,"",null,"",null,"INC"]
[null,null,null,"",null,"",null,"",null,"","",null,"",null,"",null,"",null,"INC"]
[null,null,null,"",null,"",null,"",null,"","",null,"",null,"",null,"",null,"INC"]
[null,null,null,"",null,"",null,"",null,"","",null,"",null,"",null,"",null,"INC"]

{"sheet":"VVZBF Diodes","index":10,"n_rows":251,"n_cols":28,"rows_kept":251,"cut":false,"hidden":false,"merged":[]}
["Diode Derating Worksheet (reference GSFC Document EEE-INST-002, Section S1, Table 4)",null,null,null,null,null,null,null,null,"CUI//SP-EXPT"]
[null,null,null,null,null,null,null,null,null,null,null,null,null,null,null,null,null,null,null,null,null,null,null,null,null,null,null,"Voltage Regulator"]
["Notes:","  1) Do not exceed Tj=125 °C or 40 °C below the manufacturer's maximum rating, whichever is lower.",null,null,null,null,null,null,null,null,null,null,null,null,null,null,null,null,null,null,null,null,null,null,null,null,null,"Voltage Reference"]
[null,null,null,null,null,null,null,null,null,null,null,null,null,null,null,null,null,null,null,null,null,null,null,null,null,null,null,"Zener Voltage Suppressor"]
["Voltage Regulator, Voltage Reference, Zener Voltage Suppressor, Bidirectional Voltage Suppressor and FET Current Regulator  Diodes",null,null,null,null,null,null,null,null,null,null,null,null,null,null,null,null,null,null,null,null,null,null,null,null,null,null,"Bidirect Voltage Suppressor"]
[null,null,null,null,null,null,null,null,null,null,null,null,null,null,null,null,null,null,null,null,null,null,null,null,null,null,null,"FET Current Regulator"]
[null,null,null,null,null,"     Select Diode Type First",null,null,null,null,"       Not applicable"]
[null,null,"COMPONENT SPECIFICATION SECTION",null,null,null,null,null,null,null,null,null,null,null,null,null,null,"DERATING SECTION"]
["Component","Ref. Des.","Diode Type","Operating Rated Zener Current","Zener Current Derating Factor","Operating Rated Peak Voltage","Peak Voltage Derating Factor","Operating Rated Power Dissipation","Power Dissipation Derating Factor","Maximum Junction Temp","Junction Temp Derating Factor","GSFC Derated Zener Current Rqmt","Actual Operating Zener Current","GSFC Derated Peak Voltage Rqmt","Actual Operating Peak Voltage","GSFC Derated Power Dissipation Rqmt","Actual Operating Power Dissipation","GSFC Derated Junction Temp Rqmt","Actual Operating Junction Temp","Pass/Fail","Vreg","Vref","ZVS","BVS","FET","REMARKS"]
[null,null,null,null,{"$f":"IF(D10<>\"\", IF(C10=$AB$2, 0.75, IF(C10=$AB$3, 1, \"\")), \"\")","v":""},null,{"$f":"IF((F10<>\"\")*AND(C10=$AB$6), 0.8, \"\")","v":""},null,{"$f":"IF(H10<>\"\", 0.5, \"\")","v":""},null,{"$f":"IF(J10<>\"\", 0.8, \"\")","v":""},{"$f":"IF((D10<>\"\")*AND(E10<>\"\"), D10*E10, \"\")","v":""},null,{"$f":"IF((F10<>\"\")*AND(G10<>\"\"), F10*G10, \"\")","v":""},null,{"$f":"IF(H10<>\"\", H10*I10, \"\")","v":""},null,{"$f":"IF(J10=\"\", \"\", MIN(J10*K10,125,J10-40))","v":""},null,{"$f":"IF(C10=$AB$2, U10, IF(C10=$AB$3, V10, IF(C10=$AB$4, W10, IF(C10=$AB$5, X10, IF(C10=$AB$6, Y10, \"INC\")))))","v":"INC"},{"$f":"IF(C10<>$AB$2, \"\", IF(OR(Q10=\"\", S10=\"\", M10=\"\"), \"INC\", IF(AND(Q10<=P10, S10<=R10, M10<=L10), \"PASS\", \"FAIL\")))","v":""},{"$f":"IF(C10<>$AB$3,\"\",IF(OR(M10=\"\",S10=\"\"),\"INC\",IF((M10<=L10)*AND(S10<=R10),\"PASS\",\"FAIL\")))","v":""},{"$f":"IF(C10<>$AB$4, \"\", IF(OR(Q10=\"\", S10=\"\"), \"INC\", IF((Q10<=P10)*AND(S10<=R10), \"PASS\", \"FAIL\")))","v":""},{"$f":"IF(C10<>$AB$5, \"\", IF(OR(Q10=\"\", S10=\"\"), \"INC\", IF((Q10<=P10)*AND(S10<=R10), \"PASS\", \"FAIL\")))","v":""},{"$f":"IF(C10<>$AB$6, \"\", IF(OR(O10=\"\", S10=\"\"), \"INC\", IF((O10<=N10)*AND(S10<=R10), \"PASS\", \"FAIL\")))","v":""},{"$f":"IF((C10<>\"\")*AND(C10=$AB$3), \"Estimates to be verified by CDR\", \"\")","v":""}]
[null,null,null,null,"",null,"",null,{"$f":"IF(H11<>\"\", 0.5, \"\")","v":""},null,"","",null,"",null,{"$f":"IF(H11<>\"\", H11*I11, \"\")","v":""},null,"",null,{"$f":"IF(C11=$AB$2, U11, IF(C11=$AB$3, V11, IF(C11=$AB$4, W11, IF(C11=$AB$5, X11, IF(C11=$AB$6, Y11, \"INC\")))))","v":"INC"},{"$f":"IF(C11<>$AB$2, \"\", IF(OR(Q11=\"\", S11=\"\", M11=\"\"), \"INC\", IF(AND(Q11<=P11, S11<=R11, M11<=L11), \"PASS\", \"FAIL\")))","v":""},{"$f":"IF(C11<>$AB$3,\"\",IF(OR(M11=\"\",S11=\"\"),\"INC\",IF((M11<=L11)*AND(S11<=R11),\"PASS\",\"FAIL\")))","v":""},{"$f":"IF(C11<>$AB$4, \"\", IF(OR(Q11=\"\", S11=\"\"), \"INC\", IF((Q11<=P11)*AND(S11<=R11), \"PASS\", \"FAIL\")))","v":""},{"$f":"IF(C11<>$AB$5, \"\", IF(OR(Q11=\"\", S11=\"\"), \"INC\", IF((Q11<=P11)*AND(S11<=R11), \"PASS\", \"FAIL\")))","v":""},{"$f":"IF(C11<>$AB$6, \"\", IF(OR(O11=\"\", S11=\"\"), \"INC\", IF((O11<=N11)*AND(S11<=R11), \"PASS\", \"FAIL\")))","v":""},""]
[null,null,null,null,"",null,"",null,"",null,"","",null,"",null,"",null,"",null,"INC","","","","","",""]
[null,null,null,null,"",null,"",null,"",null,"","",null,"",null,"",null,"",null,"INC","","","","","",""]
[null,null,null,null,"",null,"",null,"",null,"","",null,"",null,"",null,"",null,"INC","","","","","",""]
[null,null,null,null,"",null,"",null,"",null,"","",null,"",null,"",null,"",null,"INC","","","","","",""]
[null,null,null,null,"",null,"",null,"",null,"","",null,"",null,"",null,"",null,"INC","","","","","",""]
[null,null,null,null,"",null,"",null,"",null,"","",null,"",null,"",null,"",null,"INC","","","","","",""]
[null,null,null,null,"",null,"",null,"",null,"","",null,"",null,"",null,"",null,"INC","","","","","",""]
[null,null,null,null,"",null,"",null,"",null,"","",null,"",null,"",null,"",null,"INC","","","","","",""]
[null,null,null,null,"",null,"",null,"",null,"","",null,"",null,"",null,"",null,"INC","","","","","",""]
[null,null,null,null,"",null,"",null,"",null,"","",null,"",null,"",null,"",null,"INC","","","","","",""]
[null,null,null,null,"",null,"",null,"",null,"","",null,"",null,"",null,"",null,"INC","","","","","",""]
[null,null,null,null,"",null,"",null,"",null,"","",null,"",null,"",null,"",null,"INC","","","","","",""]
[null,null,null,null,"",null,"",null,"",null,"","",null,"",null,"",null,"",null,"INC","","","","","",""]
[null,null,null,null,"",null,"",null,"",null,"","",null,"",null,"",null,"",null,"INC","","","","","",""]
[null,null,null,null,"",null,"",null,"",null,"","",null,"",null,"",null,"",null,"INC","","","","","",""]
[null,null,null,null,"",null,"",null,"",null,"","",null,"",null,"",null,"",null,"INC","","","","","",""]
[null,null,null,null,"",null,"",null,"",null,"","",null,"",null,"",null,"",null,"INC","","","","","",""]
[null,null,null,null,"",null,"",null,"",null,"","",null,"",null,"",null,"",null,"INC","","","","","",""]
[null,null,null,null,"",null,"",null,"",null,"","",null,"",null,"",null,"",null,"INC","","","","","",""]
[null,null,null,null,"",null,"",null,"",null,"","",null,"",null,"",null,"",null,"INC","","","","","",""]
[null,null,null,null,"",null,"",null,"",null,"","",null,"",null,"",null,"",null,"INC","","","","","",""]
[null,null,null,null,"",null,"",null,"",null,"","",null,"",null,"",null,"",null,"INC","","","","","",""]
[null,null,null,null,"",null,"",null,"",null,"","",null,"",null,"",null,"",null,"INC","","","","","",""]
[null,null,null,null,"",null,"",null,"",null,"","",null,"",null,"",null,"",null,"INC","","","","","",""]
[null,null,null,null,"",null,"",null,"",null,"","",null,"",null,"",null,"",null,"INC","","","","","",""]
[null,null,null,null,"",null,"",null,"",null,"","",null,"",null,"",null,"",null,"INC","","","","","",""]
[null,null,null,null,"",null,"",null,"",null,"","",null,"",null,"",null,"",null,"INC","","","","","",""]
[null,null,null,null,"",null,"",null,"",null,"","",null,"",null,"",null,"",null,"INC","","","","","",""]
[null,null,null,null,"",null,"",null,"",null,"","",null,"",null,"",null,"",null,"INC","","","","","",""]
[null,null,null,null,"",null,"",null,"",null,"","",null,"",null,"",null,"",null,"INC","","","","","",""]
[null,null,null,null,"",null,"",null,"",null,"","",null,"",null,"",null,"",null,"INC","","","","","",""]
[null,null,null,null,"",null,"",null,"",null,"","",null,"",null,"",null,"",null,"INC","","","","","",""]
[null,null,null,null,"",null,"",null,"",null,"","",null,"",null,"",null,"",null,"INC","","","","","",""]
[null,null,null,null,"",null,"",null,"",null,"","",null,"",null,"",null,"",null,"INC","","","","","",""]
[null,null,null,null,"",null,"",null,"",null,"","",null,"",null,"",null,"",null,"INC","","","","","",""]
[null,null,null,null,"",null,"",null,"",null,"","",null,"",null,"",null,"",null,"INC","","","","","",""]
[null,null,null,null,"",null,"",null,"",null,"","",null,"",null,"",null,"",null,"INC","","","","","",""]
[null,null,null,null,"",null,"",null,"",null,"","",null,"",null,"",null,"",null,"INC","","","","","",""]
[null,null,null,null,"",null,"",null,"",null,"","",null,"",null,"",null,"",null,"INC","","","","","",""]
[null,null,null,null,"",null,"",null,"",null,"","",null,"",null,"",null,"",null,"INC","","","","","",""]
[null,null,null,null,"",null,"",null,"",null,"","",null,"",null,"",null,"",null,"INC","","","","","",""]
[null,null,null,null,"",null,"",null,"",null,"","",null,"",null,"",null,"",null,"INC","","","","","",""]
[null,null,null,null,"",null,"",null,"",null,"","",null,"",null,"",null,"",null,"INC","","","","","",""]
[null,null,null,null,"",null,"",null,"",null,"","",null,"",null,"",null,"",null,"INC","","","","","",""]
[null,null,null,null,"",null,"",null,"",null,"","",null,"",null,"",null,"",null,"INC","","","","","",""]
[null,null,null,null,"",null,"",null,"",null,"","",null,"",null,"",null,"",null,"INC","","","","","",""]
[null,null,null,null,"",null,"",null,"",null,"","",null,"",null,"",null,"",null,"INC","","","","","",""]
[null,null,null,null,"",null,"",null,"",null,"","",null,"",null,"",null,"",null,"INC","","","","","",""]
[null,null,null,null,"",null,"",null,"",null,"","",null,"",null,"",null,"",null,"INC","","","","","",""]
[null,null,null,null,"",null,"",null,"",null,"","",null,"",null,"",null,"",null,"INC","","","","","",""]
[null,null,null,null,"",null,"",null,"",null,"","",null,"",null,"",null,"",null,"INC","","","","","",""]
[null,null,null,null,"",null,"",null,"",null,"","",null,"",null,"",null,"",null,"INC","","","","","",""]
[null,null,null,null,"",null,"",null,"",null,"","",null,"",null,"",null,"",null,"INC","","","","","",""]
[null,null,null,null,"",null,"",null,"",null,"","",null,"",null,"",null,"",null,"INC","","","","","",""]
[null,null,null,null,"",null,"",null,"",null,"","",null,"",null,"",null,"",null,"INC","","","","","",""]
[null,null,null,null,"",null,"",null,"",null,"","",null,"",null,"",null,"",null,"INC","","","","","",""]
[null,null,null,null,"",null,"",null,"",null,"","",null,"",null,"",null,"",null,"INC","","","","","",""]
[null,null,null,null,"",null,"",null,"",null,"","",null,"",null,"",null,"",null,"INC","","","","","",""]
[null,null,null,null,"",null,"",null,"",null,"","",null,"",null,"",null,"",null,"INC","","","","","",""]
[null,null,null,null,"",null,"",null,"",null,"","",null,"",null,"",null,"",null,"INC","","","","","",""]
[null,null,null,null,"",null,"",null,"",null,"","",null,"",null,"",null,"",null,"INC","","","","","",""]
[null,null,null,null,"",null,"",null,"",null,"","",null,"",null,"",null,"",null,"INC","","","","","",""]
[null,null,null,null,{"$f":"IF(D74<>\"\", IF(C74=$AB$2, 0.75, IF(C74=$AB$3, 1, \"\")), \"\")","v":""},null,{"$f":"IF((F74<>\"\")*AND(C74=$AB$6), 0.8, \"\")","v":""},null,"",null,{"$f":"IF(J74<>\"\", 0.8, \"\")","v":""},{"$f":"IF((D74<>\"\")*AND(E74<>\"\"), D74*E74, \"\")","v":""},null,{"$f":"IF((F74<>\"\")*AND(G74<>\"\"), F74*G74, \"\")","v":""},null,"",null,{"$f":"IF(J74=\"\", \"\", MIN(J74*K74,125,J74-40))","v":""},null,"INC","","","","","",{"$f":"IF((C74<>\"\")*AND(C74=$AB$3), \"Estimates to be verified by CDR\", \"\")","v":""}]
[null,null,null,null,"",null,"",null,{"$f":"IF(H75<>\"\", 0.5, \"\")","v":""},null,"","",null,"",null,{"$f":"IF(H75<>\"\", H75*I75, \"\")","v":""},null,"",null,{"$f":"IF(C75=$AB$2, U75, IF(C75=$AB$3, V75, IF(C75=$AB$4, W75, IF(C75=$AB$5, X75, IF(C75=$AB$6, Y75, \"INC\")))))","v":"INC"},{"$f":"IF(C75<>$AB$2, \"\", IF(OR(Q75=\"\", S75=\"\", M75=\"\"), \"INC\", IF(AND(Q75<=P75, S75<=R75, M75<=L75), \"PASS\", \"FAIL\")))","v":""},{"$f":"IF(C75<>$AB$3,\"\",IF(OR(M75=\"\",S75=\"\"),\"INC\",IF((M75<=L75)*AND(S75<=R75),\"PASS\",\"FAIL\")))","v":""},{"$f":"IF(C75<>$AB$4, \"\", IF(OR(Q75=\"\", S75=\"\"), \"INC\", IF((Q75<=P75)*AND(S75<=R75), \"PASS\", \"FAIL\")))","v":""},{"$f":"IF(C75<>$AB$5, \"\", IF(OR(Q75=\"\", S75=\"\"), \"INC\", IF((Q75<=P75)*AND(S75<=R75), \"PASS\", \"FAIL\")))","v":""},{"$f":"IF(C75<>$AB$6, \"\", IF(OR(O75=\"\", S75=\"\"), \"INC\", IF((O75<=N75)*AND(S75<=R75), \"PASS\", \"FAIL\")))","v":""},""]
[null,null,null,null,"",null,"",null,"",null,"","",null,"",null,"",null,"",null,"INC","","","","","",""]
[null,null,null,null,"",null,"",null,"",null,"","",null,"",null,"",null,"",null,"INC","","","","","",""]
[null,null,null,null,"",null,"",null,"",null,"","",null,"",null,"",null,"",null,"INC","","","","","",""]
[null,null,null,null,"",null,"",null,"",null,"","",null,"",null,"",null,"",null,"INC","","","","","",""]
[null,null,null,null,"",null,"",null,"",null,"","",null,"",null,"",null,"",null,"INC","","","","","",""]
[null,null,null,null,"",null,"",null,"",null,"","",null,"",null,"",null,"",null,"INC","","","","","",""]
[null,null,null,null,"",null,"",null,"",null,"","",null,"",null,"",null,"",null,"INC","","","","","",""]
[null,null,null,null,"",null,"",null,"",null,"","",null,"",null,"",null,"",null,"INC","","","","","",""]
[null,null,null,null,"",null,"",null,"",null,"","",null,"",null,"",null,"",null,"INC","","","","","",""]
[null,null,null,null,"",null,"",null,"",null,"","",null,"",null,"",null,"",null,"INC","","","","","",""]
[null,null,null,null,"",null,"",null,"",null,"","",null,"",null,"",null,"",null,"INC","","","","","",""]
[null,null,null,null,"",null,"",null,"",null,"","",null,"",null,"",null,"",null,"INC","","","","","",""]
[null,null,null,null,"",null,"",null,"",null,"","",null,"",null,"",null,"",null,"INC","","","","","",""]
[null,null,null,null,"",null,"",null,"",null,"","",null,"",null,"",null,"",null,"INC","","","","","",""]
[null,null,null,null,"",null,"",null,"",null,"","",null,"",null,"",null,"",null,"INC","","","","","",""]
[null,null,null,null,"",null,"",null,"",null,"","",null,"",null,"",null,"",null,"INC","","","","","",""]
[null,null,null,null,"",null,"",null,"",null,"","",null,"",null,"",null,"",null,"INC","","","","","",""]
[null,null,null,null,"",null,"",null,"",null,"","",null,"",null,"",null,"",null,"INC","","","","","",""]
[null,null,null,null,"",null,"",null,"",null,"","",null,"",null,"",null,"",null,"INC","","","","","",""]
[null,null,null,null,"",null,"",null,"",null,"","",null,"",null,"",null,"",null,"INC","","","","","",""]
[null,null,null,null,"",null,"",null,"",null,"","",null,"",null,"",null,"",null,"INC","","","","","",""]
[null,null,null,null,"",null,"",null,"",null,"","",null,"",null,"",null,"",null,"INC","","","","","",""]
[null,null,null,null,"",null,"",null,"",null,"","",null,"",null,"",null,"",null,"INC","","","","","",""]
[null,null,null,null,"",null,"",null,"",null,"","",null,"",null,"",null,"",null,"INC","","","","","",""]
[null,null,null,null,"",null,"",null,"",null,"","",null,"",null,"",null,"",null,"INC","","","","","",""]
[null,null,null,null,"",null,"",null,"",null,"","",null,"",null,"",null,"",null,"INC","","","","","",""]
[null,null,null,null,"",null,"",null,"",null,"","",null,"",null,"",null,"",null,"INC","","","","","",""]
[null,null,null,null,"",null,"",null,"",null,"","",null,"",null,"",null,"",null,"INC","","","","","",""]
[null,null,null,null,"",null,"",null,"",null,"","",null,"",null,"",null,"",null,"INC","","","","","",""]
[null,null,null,null,"",null,"",null,"",null,"","",null,"",null,"",null,"",null,"INC","","","","","",""]
[null,null,null,null,"",null,"",null,"",null,"","",null,"",null,"",null,"",null,"INC","","","","","",""]
[null,null,null,null,"",null,"",null,"",null,"","",null,"",null,"",null,"",null,"INC","","","","","",""]
[null,null,null,null,"",null,"",null,"",null,"","",null,"",null,"",null,"",null,"INC","","","","","",""]
[null,null,null,null,"",null,"",null,"",null,"","",null,"",null,"",null,"",null,"INC","","","","","",""]
[null,null,null,null,"",null,"",null,"",null,"","",null,"",null,"",null,"",null,"INC","","","","","",""]
[null,null,null,null,"",null,"",null,"",null,"","",null,"",null,"",null,"",null,"INC","","","","","",""]
[null,null,null,null,"",null,"",null,"",null,"","",null,"",null,"",null,"",null,"INC","","","","","",""]
[null,null,null,null,"",null,"",null,"",null,"","",null,"",null,"",null,"",null,"INC","","","","","",""]
[null,null,null,null,"",null,"",null,"",null,"","",null,"",null,"",null,"",null,"INC","","","","","",""]
[null,null,null,null,"",null,"",null,"",null,"","",null,"",null,"",null,"",null,"INC","","","","","",""]
[null,null,null,null,"",null,"",null,"",null,"","",null,"",null,"",null,"",null,"INC","","","","","",""]
[null,null,null,null,"",null,"",null,"",null,"","",null,"",null,"",null,"",null,"INC","","","","","",""]
[null,null,null,null,"",null,"",null,"",null,"","",null,"",null,"",null,"",null,"INC","","","","","",""]
[null,null,null,null,"",null,"",null,"",null,"","",null,"",null,"",null,"",null,"INC","","","","","",""]
[null,null,null,null,"",null,"",null,"",null,"","",null,"",null,"",null,"",null,"INC","","","","","",""]
[null,null,null,null,"",null,"",null,"",null,"","",null,"",null,"",null,"",null,"INC","","","","","",""]
[null,null,null,null,"",null,"",null,"",null,"","",null,"",null,"",null,"",null,"INC","","","","","",""]
[null,null,null,null,"",null,"",null,"",null,"","",null,"",null,"",null,"",null,"INC","","","","","",""]
[null,null,null,null,"",null,"",null,"",null,"","",null,"",null,"",null,"",null,"INC","","","","","",""]
[null,null,null,null,"",null,"",null,"",null,"","",null,"",null,"",null,"",null,"INC","","","","","",""]
[null,null,null,null,"",null,"",null,"",null,"","",null,"",null,"",null,"",null,"INC","","","","","",""]
[null,null,null,null,"",null,"",null,"",null,"","",null,"",null,"",null,"",null,"INC","","","","","",""]
[null,null,null,null,"",null,"",null,"",null,"","",null,"",null,"",null,"",null,"INC","","","","","",""]
[null,null,null,null,"",null,"",null,"",null,"","",null,"",null,"",null,"",null,"INC","","","","","",""]
[null,null,null,null,"",null,"",null,"",null,"","",null,"",null,"",null,"",null,"INC","","","","","",""]
[null,null,null,null,"",null,"",null,"",null,"","",null,"",null,"",null,"",null,"INC","","","","","",""]
[null,null,null,null,"",null,"",null,"",null,"","",null,"",null,"",null,"",null,"INC","","","","","",""]
[null,null,null,null,"",null,"",null,"",null,"","",null,"",null,"",null,"",null,"INC","","","","","",""]
[null,null,null,null,"",null,"",null,"",null,"","",null,"",null,"",null,"",null,"INC","","","","","",""]
[null,null,null,null,"",null,"",null,"",null,"","",null,"",null,"",null,"",null,"INC","","","","","",""]
[null,null,null,null,"",null,"",null,"",null,"","",null,"",null,"",null,"",null,"INC","","","","","",""]
[null,null,null,null,"",null,"",null,"",null,"","",null,"",null,"",null,"",null,"INC","","","","","",""]
[null,null,null,null,{"$f":"IF(D138<>\"\", IF(C138=$AB$2, 0.75, IF(C138=$AB$3, 1, \"\")), \"\")","v":""},null,{"$f":"IF((F138<>\"\")*AND(C138=$AB$6), 0.8, \"\")","v":""},null,"",null,{"$f":"IF(J138<>\"\", 0.8, \"\")","v":""},{"$f":"IF((D138<>\"\")*AND(E138<>\"\"), D138*E138, \"\")","v":""},null,{"$f":"IF((F138<>\"\")*AND(G138<>\"\"), F138*G138, \"\")","v":""},null,"",null,{"$f":"IF(J138=\"\", \"\", MIN(J138*K138,125,J138-40))","v":""},null,"INC","","","","","",{"$f":"IF((C138<>\"\")*AND(C138=$AB$3), \"Estimates to be verified by CDR\", \"\")","v":""}]
[null,null,null,null,"",null,"",null,{"$f":"IF(H139<>\"\", 0.5, \"\")","v":""},null,"","",null,"",null,{"$f":"IF(H139<>\"\", H139*I139, \"\")","v":""},null,"",null,{"$f":"IF(C139=$AB$2, U139, IF(C139=$AB$3, V139, IF(C139=$AB$4, W139, IF(C139=$AB$5, X139, IF(C139=$AB$6, Y139, \"INC\")))))","v":"INC"},{"$f":"IF(C139<>$AB$2, \"\", IF(OR(Q139=\"\", S139=\"\", M139=\"\"), \"INC\", IF(AND(Q139<=P139, S139<=R139, M139<=L139), \"PASS\", \"FAIL\")))","v":""},{"$f":"IF(C139<>$AB$3,\"\",IF(OR(M139=\"\",S139=\"\"),\"INC\",IF((M139<=L139)*AND(S139<=R139),\"PASS\",\"FAIL\")))","v":""},{"$f":"IF(C139<>$AB$4, \"\", IF(OR(Q139=\"\", S139=\"\"), \"INC\", IF((Q139<=P139)*AND(S139<=R139), \"PASS\", \"FAIL\")))","v":""},{"$f":"IF(C139<>$AB$5, \"\", IF(OR(Q139=\"\", S139=\"\"), \"INC\", IF((Q139<=P139)*AND(S139<=R139), \"PASS\", \"FAIL\")))","v":""},{"$f":"IF(C139<>$AB$6, \"\", IF(OR(O139=\"\", S139=\"\"), \"INC\", IF((O139<=N139)*AND(S139<=R139), \"PASS\", \"FAIL\")))","v":""},""]
[null,null,null,null,"",null,"",null,"",null,"","",null,"",null,"",null,"",null,"INC","","","","","",""]
[null,null,null,null,"",null,"",null,"",null,"","",null,"",null,"",null,"",null,"INC","","","","","",""]
[null,null,null,null,"",null,"",null,"",null,"","",null,"",null,"",null,"",null,"INC","","","","","",""]
[null,null,null,null,"",null,"",null,"",null,"","",null,"",null,"",null,"",null,"INC","","","","","",""]
[null,null,null,null,"",null,"",null,"",null,"","",null,"",null,"",null,"",null,"INC","","","","","",""]
[null,null,null,null,"",null,"",null,"",null,"","",null,"",null,"",null,"",null,"INC","","","","","",""]
[null,null,null,null,"",null,"",null,"",null,"","",null,"",null,"",null,"",null,"INC","","","","","",""]
[null,null,null,null,"",null,"",null,"",null,"","",null,"",null,"",null,"",null,"INC","","","","","",""]
[null,null,null,null,"",null,"",null,"",null,"","",null,"",null,"",null,"",null,"INC","","","","","",""]
[null,null,null,null,"",null,"",null,"",null,"","",null,"",null,"",null,"",null,"INC","","","","","",""]
[null,null,null,null,"",null,"",null,"",null,"","",null,"",null,"",null,"",null,"INC","","","","","",""]
[null,null,null,null,"",null,"",null,"",null,"","",null,"",null,"",null,"",null,"INC","","","","","",""]
[null,null,null,null,"",null,"",null,"",null,"","",null,"",null,"",null,"",null,"INC","","","","","",""]
[null,null,null,null,"",null,"",null,"",null,"","",null,"",null,"",null,"",null,"INC","","","","","",""]
[null,null,null,null,"",null,"",null,"",null,"","",null,"",null,"",null,"",null,"INC","","","","","",""]
[null,null,null,null,"",null,"",null,"",null,"","",null,"",null,"",null,"",null,"INC","","","","","",""]
[null,null,null,null,"",null,"",null,"",null,"","",null,"",null,"",null,"",null,"INC","","","","","",""]
[null,null,null,null,"",null,"",null,"",null,"","",null,"",null,"",null,"",null,"INC","","","","","",""]
[null,null,null,null,"",null,"",null,"",null,"","",null,"",null,"",null,"",null,"INC","","","","","",""]
[null,null,null,null,"",null,"",null,"",null,"","",null,"",null,"",null,"",null,"INC","","","","","",""]
[null,null,null,null,"",null,"",null,"",null,"","",null,"",null,"",null,"",null,"INC","","","","","",""]
[null,null,null,null,"",null,"",null,"",null,"","",null,"",null,"",null,"",null,"INC","","","","","",""]
[null,null,null,null,"",null,"",null,"",null,"","",null,"",null,"",null,"",null,"INC","","","","","",""]
[null,null,null,null,"",null,"",null,"",null,"","",null,"",null,"",null,"",null,"INC","","","","","",""]
[null,null,null,null,"",null,"",null,"",null,"","",null,"",null,"",null,"",null,"INC","","","","","",""]
[null,null,null,null,"",null,"",null,"",null,"","",null,"",null,"",null,"",null,"INC","","","","","",""]
[null,null,null,null,"",null,"",null,"",null,"","",null,"",null,"",null,"",null,"INC","","","","","",""]
[null,null,null,null,"",null,"",null,"",null,"","",null,"",null,"",null,"",null,"INC","","","","","",""]
[null,null,null,null,"",null,"",null,"",null,"","",null,"",null,"",null,"",null,"INC","","","","","",""]
[null,null,null,null,"",null,"",null,"",null,"","",null,"",null,"",null,"",null,"INC","","","","","",""]
[null,null,null,null,"",null,"",null,"",null,"","",null,"",null,"",null,"",null,"INC","","","","","",""]
[null,null,null,null,"",null,"",null,"",null,"","",null,"",null,"",null,"",null,"INC","","","","","",""]
[null,null,null,null,"",null,"",null,"",null,"","",null,"",null,"",null,"",null,"INC","","","","","",""]
[null,null,null,null,"",null,"",null,"",null,"","",null,"",null,"",null,"",null,"INC","","","","","",""]
[null,null,null,null,"",null,"",null,"",null,"","",null,"",null,"",null,"",null,"INC","","","","","",""]
[null,null,null,null,"",null,"",null,"",null,"","",null,"",null,"",null,"",null,"INC","","","","","",""]
[null,null,null,null,"",null,"",null,"",null,"","",null,"",null,"",null,"",null,"INC","","","","","",""]
[null,null,null,null,"",null,"",null,"",null,"","",null,"",null,"",null,"",null,"INC","","","","","",""]
[null,null,null,null,"",null,"",null,"",null,"","",null,"",null,"",null,"",null,"INC","","","","","",""]
[null,null,null,null,"",null,"",null,"",null,"","",null,"",null,"",null,"",null,"INC","","","","","",""]
[null,null,null,null,"",null,"",null,"",null,"","",null,"",null,"",null,"",null,"INC","","","","","",""]
[null,null,null,null,"",null,"",null,"",null,"","",null,"",null,"",null,"",null,"INC","","","","","",""]
[null,null,null,null,"",null,"",null,"",null,"","",null,"",null,"",null,"",null,"INC","","","","","",""]
[null,null,null,null,"",null,"",null,"",null,"","",null,"",null,"",null,"",null,"INC","","","","","",""]
[null,null,null,null,"",null,"",null,"",null,"","",null,"",null,"",null,"",null,"INC","","","","","",""]
[null,null,null,null,"",null,"",null,"",null,"","",null,"",null,"",null,"",null,"INC","","","","","",""]
[null,null,null,null,"",null,"",null,"",null,"","",null,"",null,"",null,"",null,"INC","","","","","",""]
[null,null,null,null,"",null,"",null,"",null,"","",null,"",null,"",null,"",null,"INC","","","","","",""]
[null,null,null,null,"",null,"",null,"",null,"","",null,"",null,"",null,"",null,"INC","","","","","",""]
[null,null,null,null,"",null,"",null,"",null,"","",null,"",null,"",null,"",null,"INC","","","","","",""]
[null,null,null,null,"",null,"",null,"",null,"","",null,"",null,"",null,"",null,"INC","","","","","",""]
[null,null,null,null,"",null,"",null,"",null,"","",null,"",null,"",null,"",null,"INC","","","","","",""]
[null,null,null,null,"",null,"",null,"",null,"","",null,"",null,"",null,"",null,"INC","","","","","",""]
[null,null,null,null,"",null,"",null,"",null,"","",null,"",null,"",null,"",null,"INC","","","","","",""]
[null,null,null,null,"",null,"",null,"",null,"","",null,"",null,"",null,"",null,"INC","","","","","",""]
[null,null,null,null,"",null,"",null,"",null,"","",null,"",null,"",null,"",null,"INC","","","","","",""]
[null,null,null,null,"",null,"",null,"",null,"","",null,"",null,"",null,"",null,"INC","","","","","",""]
[null,null,null,null,"",null,"",null,"",null,"","",null,"",null,"",null,"",null,"INC","","","","","",""]
[null,null,null,null,"",null,"",null,"",null,"","",null,"",null,"",null,"",null,"INC","","","","","",""]
[null,null,null,null,"",null,"",null,"",null,"","",null,"",null,"",null,"",null,"INC","","","","","",""]
[null,null,null,null,"",null,"",null,"",null,"","",null,"",null,"",null,"",null,"INC","","","","","",""]
[null,null,null,null,"",null,"",null,"",null,"","",null,"",null,"",null,"",null,"INC","","","","","",""]
[null,null,null,null,{"$f":"IF(D202<>\"\", IF(C202=$AB$2, 0.75, IF(C202=$AB$3, 1, \"\")), \"\")","v":""},null,{"$f":"IF((F202<>\"\")*AND(C202=$AB$6), 0.8, \"\")","v":""},null,"",null,{"$f":"IF(J202<>\"\", 0.8, \"\")","v":""},{"$f":"IF((D202<>\"\")*AND(E202<>\"\"), D202*E202, \"\")","v":""},null,{"$f":"IF((F202<>\"\")*AND(G202<>\"\"), F202*G202, \"\")","v":""},null,"",null,{"$f":"IF(J202=\"\", \"\", MIN(J202*K202,125,J202-40))","v":""},null,"INC","","","","","",{"$f":"IF((C202<>\"\")*AND(C202=$AB$3), \"Estimates to be verified by CDR\", \"\")","v":""}]
[null,null,null,null,"",null,"",null,{"$f":"IF(H203<>\"\", 0.5, \"\")","v":""},null,"","",null,"",null,{"$f":"IF(H203<>\"\", H203*I203, \"\")","v":""},null,"",null,{"$f":"IF(C203=$AB$2, U203, IF(C203=$AB$3, V203, IF(C203=$AB$4, W203, IF(C203=$AB$5, X203, IF(C203=$AB$6, Y203, \"INC\")))))","v":"INC"},{"$f":"IF(C203<>$AB$2, \"\", IF(OR(Q203=\"\", S203=\"\", M203=\"\"), \"INC\", IF(AND(Q203<=P203, S203<=R203, M203<=L203), \"PASS\", \"FAIL\")))","v":""},{"$f":"IF(C203<>$AB$3,\"\",IF(OR(M203=\"\",S203=\"\"),\"INC\",IF((M203<=L203)*AND(S203<=R203),\"PASS\",\"FAIL\")))","v":""},{"$f":"IF(C203<>$AB$4, \"\", IF(OR(Q203=\"\", S203=\"\"), \"INC\", IF((Q203<=P203)*AND(S203<=R203), \"PASS\", \"FAIL\")))","v":""},{"$f":"IF(C203<>$AB$5, \"\", IF(OR(Q203=\"\", S203=\"\"), \"INC\", IF((Q203<=P203)*AND(S203<=R203), \"PASS\", \"FAIL\")))","v":""},{"$f":"IF(C203<>$AB$6, \"\", IF(OR(O203=\"\", S203=\"\"), \"INC\", IF((O203<=N203)*AND(S203<=R203), \"PASS\", \"FAIL\")))","v":""},""]
[null,null,null,null,"",null,"",null,"",null,"","",null,"",null,"",null,"",null,"INC","","","","","",""]
[null,null,null,null,"",null,"",null,"",null,"","",null,"",null,"",null,"",null,"INC","","","","","",""]
[null,null,null,null,"",null,"",null,"",null,"","",null,"",null,"",null,"",null,"INC","","","","","",""]
[null,null,null,null,"",null,"",null,"",null,"","",null,"",null,"",null,"",null,"INC","","","","","",""]
[null,null,null,null,"",null,"",null,"",null,"","",null,"",null,"",null,"",null,"INC","","","","","",""]
[null,null,null,null,"",null,"",null,"",null,"","",null,"",null,"",null,"",null,"INC","","","","","",""]
[null,null,null,null,"",null,"",null,"",null,"","",null,"",null,"",null,"",null,"INC","","","","","",""]
[null,null,null,null,"",null,"",null,"",null,"","",null,"",null,"",null,"",null,"INC","","","","","",""]
[null,null,null,null,"",null,"",null,"",null,"","",null,"",null,"",null,"",null,"INC","","","","","",""]
[null,null,null,null,"",null,"",null,"",null,"","",null,"",null,"",null,"",null,"INC","","","","","",""]
[null,null,null,null,"",null,"",null,"",null,"","",null,"",null,"",null,"",null,"INC","","","","","",""]
[null,null,null,null,"",null,"",null,"",null,"","",null,"",null,"",null,"",null,"INC","","","","","",""]
[null,null,null,null,"",null,"",null,"",null,"","",null,"",null,"",null,"",null,"INC","","","","","",""]
[null,null,null,null,"",null,"",null,"",null,"","",null,"",null,"",null,"",null,"INC","","","","","",""]
[null,null,null,null,"",null,"",null,"",null,"","",null,"",null,"",null,"",null,"INC","","","","","",""]
[null,null,null,null,"",null,"",null,"",null,"","",null,"",null,"",null,"",null,"INC","","","","","",""]
[null,null,null,null,"",null,"",null,"",null,"","",null,"",null,"",null,"",null,"INC","","","","","",""]
[null,null,null,null,"",null,"",null,"",null,"","",null,"",null,"",null,"",null,"INC","","","","","",""]
[null,null,null,null,"",null,"",null,"",null,"","",null,"",null,"",null,"",null,"INC","","","","","",""]
[null,null,null,null,"",null,"",null,"",null,"","",null,"",null,"",null,"",null,"INC","","","","","",""]
[null,null,null,null,"",null,"",null,"",null,"","",null,"",null,"",null,"",null,"INC","","","","","",""]
[null,null,null,null,"",null,"",null,"",null,"","",null,"",null,"",null,"",null,"INC","","","","","",""]
[null,null,null,null,"",null,"",null,"",null,"","",null,"",null,"",null,"",null,"INC","","","","","",""]
[null,null,null,null,"",null,"",null,"",null,"","",null,"",null,"",null,"",null,"INC","","","","","",""]
[null,null,null,null,"",null,"",null,"",null,"","",null,"",null,"",null,"",null,"INC","","","","","",""]
[null,null,null,null,"",null,"",null,"",null,"","",null,"",null,"",null,"",null,"INC","","","","","",""]
[null,null,null,null,"",null,"",null,"",null,"","",null,"",null,"",null,"",null,"INC","","","","","",""]
[null,null,null,null,"",null,"",null,"",null,"","",null,"",null,"",null,"",null,"INC","","","","","",""]
[null,null,null,null,"",null,"",null,"",null,"","",null,"",null,"",null,"",null,"INC","","","","","",""]
[null,null,null,null,"",null,"",null,"",null,"","",null,"",null,"",null,"",null,"INC","","","","","",""]
[null,null,null,null,"",null,"",null,"",null,"","",null,"",null,"",null,"",null,"INC","","","","","",""]
[null,null,null,null,"",null,"",null,"",null,"","",null,"",null,"",null,"",null,"INC","","","","","",""]
[null,null,null,null,"",null,"",null,"",null,"","",null,"",null,"",null,"",null,"INC","","","","","",""]
[null,null,null,null,"",null,"",null,"",null,"","",null,"",null,"",null,"",null,"INC","","","","","",""]
[null,null,null,null,"",null,"",null,"",null,"","",null,"",null,"",null,"",null,"INC","","","","","",""]
[null,null,null,null,"",null,"",null,"",null,"","",null,"",null,"",null,"",null,"INC","","","","","",""]
[null,null,null,null,"",null,"",null,"",null,"","",null,"",null,"",null,"",null,"INC","","","","","",""]
[null,null,null,null,"",null,"",null,"",null,"","",null,"",null,"",null,"",null,"INC","","","","","",""]
[null,null,null,null,"",null,"",null,"",null,"","",null,"",null,"",null,"",null,"INC","","","","","",""]
[null,null,null,null,"",null,"",null,"",null,"","",null,"",null,"",null,"",null,"INC","","","","","",""]
[null,null,null,null,"",null,"",null,"",null,"","",null,"",null,"",null,"",null,"INC","","","","","",""]
[null,null,null,null,"",null,"",null,"",null,"","",null,"",null,"",null,"",null,"INC","","","","","",""]
[null,null,null,null,"",null,"",null,"",null,"","",null,"",null,"",null,"",null,"INC","","","","","",""]
[null,null,null,null,"",null,"",null,"",null,"","",null,"",null,"",null,"",null,"INC","","","","","",""]
[null,null,null,null,"",null,"",null,"",null,"","",null,"",null,"",null,"",null,"INC","","","","","",""]
[null,null,null,null,"",null,"",null,"",null,"","",null,"",null,"",null,"",null,"INC","","","","","",""]
[null,null,null,null,"",null,"",null,"",null,"","",null,"",null,"",null,"",null,"INC","","","","","",""]
[null,null,null,null,"",null,"",null,"",null,"","",null,"",null,"",null,"",null,"INC","","","","","",""]

{"sheet":"Varactor Diode","index":11,"n_rows":109,"n_cols":20,"rows_kept":109,"cut":false,"hidden":false,"merged":[]}
["Diode Derating Worksheet (reference GSFC Document EEE-INST-002, Section S1, Table 4)",null,null,null,null,null,null,null,null,"CUI//SP-EXPT"]
[]
[null,"Notes:"]
[null,"1) Do not exceed Tj=125 °C or 40 °C below the manufacturer's maximum rating, whichever is lower."]
[]
["Varactor Diode Derating Worksheet"]
[]
[null,null,"COMPONENT SPECIFICATION SECTION",null,null,null,null,null,null,null,null,null,null,null,null,"DERATING SECTION"]
["Component","Ref. Des.","Rated Operating Rated Power","Power Derating Factor","Operating Rated Reverse Voltage","Reverse Voltage Derating Factor","Operating Rated Forward Current","Forward Current Derating Factor","Rated Maximum Junction Temp.","Junction Temp. Derating Factor","GSFC Derated Power Rqmt","Actual Operating Power","GSFC Derated Reverse Voltage Rqmt","Actual Operating Reverse Voltage","GSFC Derated Forward Current Rqmt","Actual Operating Forward Current","GSFC Derated Junction Temp. Rqmt","Actual Operating Junction Temp.","Pass/Fail","REMARKS"]
[null,null,null,{"$f":"IF(C10<>\"\", 0.5, \"\")","v":""},null,{"$f":"IF(E10<>\"\", 0.75, \"\")","v":""},null,{"$f":"IF(G10<>\"\", 0.75, \"\")","v":""},null,{"$f":"IF(I10<>\"\", 0.8, \"\")","v":""},{"$f":"IF(C10<>\"\", C10*D10, \"\")","v":""},null,{"$f":"IF(E10<>\"\", E10*F10, \"\")","v":""},null,{"$f":"IF(G10<>\"\", G10*H10, \"\")","v":""},null,{"$f":"IF(I10<>\"\", MIN(I10*J10, 125, (I10-40)), \"\")","v":""},null,{"$f":"IF((K10<>\"\")*AND(L10<>\"\")*AND(M10<>\"\")*AND(N10<>\"\")*AND(O10<>\"\")*AND(P10<>\"\")*AND(Q10<>\"\")*AND(R10<>\"\"), IF((L10<=K10)*AND(N10<=M10)*AND(P10<=O10)*AND(R10<=Q10),\"PASS\",\"FAIL\"), \"INC\")","v":"INC"}]
[null,null,null,"",null,"",null,"",null,"","",null,"",null,"",null,"",null,"INC"]
[null,null,null,"",null,"",null,"",null,"","",null,"",null,"",null,"",null,"INC"]
[null,null,null,"",null,"",null,"",null,"","",null,"",null,"",null,"",null,"INC"]
[null,null,null,"",null,"",null,"",null,"","",null,"",null,"",null,"",null,"INC"]
[null,null,null,"",null,"",null,"",null,"","",null,"",null,"",null,"",null,"INC"]
[null,null,null,"",null,"",null,"",null,"","",null,"",null,"",null,"",null,"INC"]
[null,null,null,"",null,"",null,"",null,"","",null,"",null,"",null,"",null,"INC"]
[null,null,null,"",null,"",null,"",null,"","",null,"",null,"",null,"",null,"INC"]
[null,null,null,"",null,"",null,"",null,"","",null,"",null,"",null,"",null,"INC"]
[null,null,null,"",null,"",null,"",null,"","",null,"",null,"",null,"",null,"INC"]
[null,null,null,"",null,"",null,"",null,"","",null,"",null,"",null,"",null,"INC"]
[null,null,null,"",null,"",null,"",null,"","",null,"",null,"",null,"",null,"INC"]
[null,null,null,"",null,"",null,"",null,"","",null,"",null,"",null,"",null,"INC"]
[null,null,null,"",null,"",null,"",null,"","",null,"",null,"",null,"",null,"INC"]
[null,null,null,"",null,"",null,"",null,"","",null,"",null,"",null,"",null,"INC"]
[null,null,null,"",null,"",null,"",null,"","",null,"",null,"",null,"",null,"INC"]
[null,null,null,"",null,"",null,"",null,"","",null,"",null,"",null,"",null,"INC"]
[null,null,null,"",null,"",null,"",null,"","",null,"",null,"",null,"",null,"INC"]
[null,null,null,"",null,"",null,"",null,"","",null,"",null,"",null,"",null,"INC"]
[null,null,null,"",null,"",null,"",null,"","",null,"",null,"",null,"",null,"INC"]
[null,null,null,"",null,"",null,"",null,"","",null,"",null,"",null,"",null,"INC"]
[null,null,null,"",null,"",null,"",null,"","",null,"",null,"",null,"",null,"INC"]
[null,null,null,"",null,"",null,"",null,"","",null,"",null,"",null,"",null,"INC"]
[null,null,null,"",null,"",null,"",null,"","",null,"",null,"",null,"",null,"INC"]
[null,null,null,"",null,"",null,"",null,"","",null,"",null,"",null,"",null,"INC"]
[null,null,null,"",null,"",null,"",null,"","",null,"",null,"",null,"",null,"INC"]
[null,null,null,"",null,"",null,"",null,"","",null,"",null,"",null,"",null,"INC"]
[null,null,null,"",null,"",null,"",null,"","",null,"",null,"",null,"",null,"INC"]
[null,null,null,"",null,"",null,"",null,"","",null,"",null,"",null,"",null,"INC"]
[null,null,null,"",null,"",null,"",null,"","",null,"",null,"",null,"",null,"INC"]
[null,null,null,"",null,"",null,"",null,"","",null,"",null,"",null,"",null,"INC"]
[null,null,null,"",null,"",null,"",null,"","",null,"",null,"",null,"",null,"INC"]
[null,null,null,"",null,"",null,"",null,"","",null,"",null,"",null,"",null,"INC"]
[null,null,null,"",null,"",null,"",null,"","",null,"",null,"",null,"",null,"INC"]
[null,null,null,"",null,"",null,"",null,"","",null,"",null,"",null,"",null,"INC"]
[null,null,null,"",null,"",null,"",null,"","",null,"",null,"",null,"",null,"INC"]
[null,null,null,"",null,"",null,"",null,"","",null,"",null,"",null,"",null,"INC"]
[null,null,null,"",null,"",null,"",null,"","",null,"",null,"",null,"",null,"INC"]
[null,null,null,"",null,"",null,"",null,"","",null,"",null,"",null,"",null,"INC"]
[null,null,null,"",null,"",null,"",null,"","",null,"",null,"",null,"",null,"INC"]
[null,null,null,"",null,"",null,"",null,"","",null,"",null,"",null,"",null,"INC"]
[null,null,null,"",null,"",null,"",null,"","",null,"",null,"",null,"",null,"INC"]
[null,null,null,"",null,"",null,"",null,"","",null,"",null,"",null,"",null,"INC"]
[null,null,null,"",null,"",null,"",null,"","",null,"",null,"",null,"",null,"INC"]
[null,null,null,"",null,"",null,"",null,"","",null,"",null,"",null,"",null,"INC"]
[null,null,null,"",null,"",null,"",null,"","",null,"",null,"",null,"",null,"INC"]
[null,null,null,"",null,"",null,"",null,"","",null,"",null,"",null,"",null,"INC"]
[null,null,null,"",null,"",null,"",null,"","",null,"",null,"",null,"",null,"INC"]
[null,null,null,"",null,"",null,"",null,"","",null,"",null,"",null,"",null,"INC"]
[null,null,null,"",null,"",null,"",null,"","",null,"",null,"",null,"",null,"INC"]
[null,null,null,"",null,"",null,"",null,"","",null,"",null,"",null,"",null,"INC"]
[null,null,null,"",null,"",null,"",null,"","",null,"",null,"",null,"",null,"INC"]
[null,null,null,"",null,"",null,"",null,"","",null,"",null,"",null,"",null,"INC"]
[null,null,null,"",null,"",null,"",null,"","",null,"",null,"",null,"",null,"INC"]
[null,null,null,"",null,"",null,"",null,"","",null,"",null,"",null,"",null,"INC"]
[null,null,null,"",null,"",null,"",null,"","",null,"",null,"",null,"",null,"INC"]
[null,null,null,"",null,"",null,"",null,"","",null,"",null,"",null,"",null,"INC"]
[null,null,null,"",null,"",null,"",null,"","",null,"",null,"",null,"",null,"INC"]
[null,null,null,"",null,"",null,"",null,"","",null,"",null,"",null,"",null,"INC"]
[null,null,null,"",null,"",null,"",null,"","",null,"",null,"",null,"",null,"INC"]
[null,null,null,"",null,"",null,"",null,"","",null,"",null,"",null,"",null,"INC"]
[null,null,null,"",null,"",null,"",null,"","",null,"",null,"",null,"",null,"INC"]
[null,null,null,"",null,"",null,"",null,"","",null,"",null,"",null,"",null,"INC"]
[null,null,null,{"$f":"IF(C74<>\"\", 0.5, \"\")","v":""},null,{"$f":"IF(E74<>\"\", 0.75, \"\")","v":""},null,{"$f":"IF(G74<>\"\", 0.75, \"\")","v":""},null,{"$f":"IF(I74<>\"\", 0.8, \"\")","v":""},{"$f":"IF(C74<>\"\", C74*D74, \"\")","v":""},null,{"$f":"IF(E74<>\"\", E74*F74, \"\")","v":""},null,{"$f":"IF(G74<>\"\", G74*H74, \"\")","v":""},null,{"$f":"IF(I74<>\"\", MIN(I74*J74, 125, (I74-40)), \"\")","v":""},null,{"$f":"IF((K74<>\"\")*AND(L74<>\"\")*AND(M74<>\"\")*AND(N74<>\"\")*AND(O74<>\"\")*AND(P74<>\"\")*AND(Q74<>\"\")*AND(R74<>\"\"), IF((L74<=K74)*AND(N74<=M74)*AND(P74<=O74)*AND(R74<=Q74),\"PASS\",\"FAIL\"), \"INC\")","v":"INC"}]
[null,null,null,"",null,"",null,"",null,"","",null,"",null,"",null,"",null,"INC"]
[null,null,null,"",null,"",null,"",null,"","",null,"",null,"",null,"",null,"INC"]
[null,null,null,"",null,"",null,"",null,"","",null,"",null,"",null,"",null,"INC"]
[null,null,null,"",null,"",null,"",null,"","",null,"",null,"",null,"",null,"INC"]
[null,null,null,"",null,"",null,"",null,"","",null,"",null,"",null,"",null,"INC"]
[null,null,null,"",null,"",null,"",null,"","",null,"",null,"",null,"",null,"INC"]
[null,null,null,"",null,"",null,"",null,"","",null,"",null,"",null,"",null,"INC"]
[null,null,null,"",null,"",null,"",null,"","",null,"",null,"",null,"",null,"INC"]
[null,null,null,"",null,"",null,"",null,"","",null,"",null,"",null,"",null,"INC"]
[null,null,null,"",null,"",null,"",null,"","",null,"",null,"",null,"",null,"INC"]
[null,null,null,"",null,"",null,"",null,"","",null,"",null,"",null,"",null,"INC"]
[null,null,null,"",null,"",null,"",null,"","",null,"",null,"",null,"",null,"INC"]
[null,null,null,"",null,"",null,"",null,"","",null,"",null,"",null,"",null,"INC"]
[null,null,null,"",null,"",null,"",null,"","",null,"",null,"",null,"",null,"INC"]
[null,null,null,"",null,"",null,"",null,"","",null,"",null,"",null,"",null,"INC"]
[null,null,null,"",null,"",null,"",null,"","",null,"",null,"",null,"",null,"INC"]
[null,null,null,"",null,"",null,"",null,"","",null,"",null,"",null,"",null,"INC"]
[null,null,null,"",null,"",null,"",null,"","",null,"",null,"",null,"",null,"INC"]
[null,null,null,"",null,"",null,"",null,"","",null,"",null,"",null,"",null,"INC"]
[null,null,null,"",null,"",null,"",null,"","",null,"",null,"",null,"",null,"INC"]
[null,null,null,"",null,"",null,"",null,"","",null,"",null,"",null,"",null,"INC"]
[null,null,null,"",null,"",null,"",null,"","",null,"",null,"",null,"",null,"INC"]
[null,null,null,"",null,"",null,"",null,"","",null,"",null,"",null,"",null,"INC"]
[null,null,null,"",null,"",null,"",null,"","",null,"",null,"",null,"",null,"INC"]
[null,null,null,"",null,"",null,"",null,"","",null,"",null,"",null,"",null,"INC"]
[null,null,null,"",null,"",null,"",null,"","",null,"",null,"",null,"",null,"INC"]
[null,null,null,"",null,"",null,"",null,"","",null,"",null,"",null,"",null,"INC"]
[null,null,null,"",null,"",null,"",null,"","",null,"",null,"",null,"",null,"INC"]
[null,null,null,"",null,"",null,"",null,"","",null,"",null,"",null,"",null,"INC"]
[null,null,null,"",null,"",null,"",null,"","",null,"",null,"",null,"",null,"INC"]
[null,null,null,"",null,"",null,"",null,"","",null,"",null,"",null,"",null,"INC"]
[null,null,null,"",null,"",null,"",null,"","",null,"",null,"",null,"",null,"INC"]
[null,null,null,"",null,"",null,"",null,"","",null,"",null,"",null,"",null,"INC"]
[null,null,null,"",null,"",null,"",null,"","",null,"",null,"",null,"",null,"INC"]
[null,null,null,"",null,"",null,"",null,"","",null,"",null,"",null,"",null,"INC"]

{"sheet":"Microcircuit - Hermetic","index":12,"n_rows":246,"n_cols":33,"rows_kept":246,"cut":false,"hidden":false,"merged":[[11,17,11,20]]}
["Microcircuit Derating Worksheet (reference GSFC Document EEE-INST-002, Section M3, Table 4)",null,null,null,null,null,null,null,null,"CUI//SP-EXPT"]
[]
[null,"Notes:","1) For Maximum Supply/Input voltage, use manufacturer's recommended operating conditions but do not exceed 90% of maximum supply voltage for digital devices"]
[null,null,"    and 80% of maximum supply voltage for lineardevices. For voltage regulators, derate Vin-Vout to 0.9.",null,null,null,null,null,null,null,null,null,null,null,null,null,null,null,null,null,null,"Digital",0.9,0.8]
[null,null,"    1.1) For low voltage (<5V) devices, use manufacturer's recommended operating conditions.",null,null,null,null,null,null,null,null,null,null,null,null,null,null,null,null,null,null,"Linear",0.8,0.75]
[null,null,"2) For Maximum Specified Operating Junction Temperature, do not exceed Tj = 110°C, or 40°C below the manufacturer's maximum rating, whichever is lower or less."]
[null,null,"3) Consult the project radiation engineer to determine derating guidelines that account for radiation induced degradation (total ionizing dose, single"]
[null,null,"    event effects and displacement damage) in parts over the lifetime of each mission."]
[]
["Hermetically Sealed Microcircuits (Metal and Ceramic Cased)",null,null,null,null,null,null," Select Part Type First",null,null,"     Maximum Board Temperature  =",null,null,null,null,null,75]
[]
[null,null,"COMPONENT SPECIFICATION SECTION",null,null,null,null,null,null,null,null,null,null,null,null,null,null,"DERATING SECTION"]
["Component","Ref. Des.","Part Type","Maximum Supply or Input Voltage Rated","Voltage Derating Factor"," Maximum Specified Power Dissipation Rated","Power Dissipation Derating Factor","Maximum Specified Operating Junction Temp, Rated","Junction Temp. Derating Factor","Theta JC  °C/W","Maximum Specified Output Current, Rated","Output Current Derating Factor","Rated Clock Frequency","Clock Frequency Derating Factor","GSFC Derated Voltage Rqmt","Actual Operating Voltage","GSFC Derated Power Dissipation Rqmt","Actual Power Dissipation","GSFC Derated Junction Temp Rqmt","Actual Operating Junction Temp","GSFC Derated Output Current Rqmt","Actual  Output Current","GSFC Derated Clock Frequency Rqmt","Actual Clock Freq","Pass/Fail","Linear","Digital","Operating Voltage","Power Dissipation","Junction Temperature","Output Current","Clock Frequency","REMARKS"]
[null,null,null,null,{"$f":" IF(C14=\"Digital\", 0.9, IF(C14=\"Linear\", 0.8, \"\"))","v":""},null,{"$f":"IF(C14=\"Digital\", 0.8, IF(C14=\"Linear\", 0.75, \"\"))","v":""},null,{"$f":"IF(C14=\"Digital\", 0.8, IF(C14=\"Linear\", 0.75, \"\"))","v":""},null,null,{"$f":"IF(K14<>\"\",0.8,\"\")","v":""},null,{"$f":"IF(M14<>\"\",0.8,\"\")","v":""},{"$f":"IF((D14<>\"\")*AND(E14<>\"\"), IF(ABS(D14)<5,D14,D14*E14),\"\")","v":""},null,{"$f":"IF((F14<>\"\")*AND(G14<>\"\"), F14*G14, \"\")","v":""},null,{"$f":"IF((H14<>\"\")*AND(I14<>\"\"), MIN(H14*I14, (H14-40), 110), \"\")","v":""},null,{"$f":"IF(K14<>\"\", K14*L14, \"\")","v":""},null,{"$f":"IF(M14<>\"\", M14*N14, \"\")","v":""},null,{"$f":"IF(C14=$V$5,Z14, IF(C14=$V$4,AA14,\"INC\"))","v":"INC"},{"$f":"IF(C14=$V$4,\"\",IF(OR(AB14=\"FAIL\",AC14=\"FAIL\",AD14=\"FAIL\",AE14=\"FAIL\"),\"FAIL\",IF(OR(AB14=\"INC\",AC14=\"INC\",AD14=\"INC\",AE14=\"INC\"),\"INC\",\"PASS\")))","v":"INC"},{"$f":"IF(C14=$V$5,\"\",IF(OR(AB14=\"FAIL\",AC14=\"FAIL\",AD14=\"FAIL\",AE14=\"FAIL\",AF14=\"FAIL\"),\"FAIL\",IF(OR(AB14=\"INC\",AC14=\"INC\",AD14=\"INC\",AE14=\"INC\",AF14=\"INC\"),\"INC\",\"PASS\")))","v":"INC"},{"$f":"IF(OR(O14=\"\",P14=\"\"),\"INC\",IF(ABS(P14)<=ABS(O14),\"PASS\",\"FAIL\"))","v":"INC"},{"$f":"IF(OR(Q14=\"\",R14=\"\"),\"INC\",IF(R14<=Q14,\"PASS\",\"FAIL\"))","v":"INC"},{"$f":"IF(OR(S14=\"\",T14=\"\"),\"INC\",IF(T14<=S14,\"PASS\",\"FAIL\"))","v":"INC"},{"$f":"IF(OR(U14=\"\",V14=\"\"),\"INC\",IF(V14<=U14,\"PASS\",\"FAIL\"))","v":"INC"},{"$f":"IF(OR(W14=\"\",X14=\"\"),\"INC\",IF(X14<=W14,\"PASS\",\"FAIL\"))","v":"INC"}]
[null,null,null,null,"",null,"",null,"",null,null,{"$f":"IF(K15<>\"\",0.8,\"\")","v":""},null,{"$f":"IF(M15<>\"\",0.8,\"\")","v":""},"",null,"",null,"",null,{"$f":"IF(K15<>\"\", K15*L15, \"\")","v":""},null,{"$f":"IF(M15<>\"\", M15*N15, \"\")","v":""},null,{"$f":"IF(C15=$V$5,Z15, IF(C15=$V$4,AA15,\"INC\"))","v":"INC"},{"$f":"IF(C15=$V$4,\"\",IF(OR(AB15=\"FAIL\",AC15=\"FAIL\",AD15=\"FAIL\",AE15=\"FAIL\"),\"FAIL\",IF(OR(AB15=\"INC\",AC15=\"INC\",AD15=\"INC\",AE15=\"INC\"),\"INC\",\"PASS\")))","v":"INC"},{"$f":"IF(C15=$V$5,\"\",IF(OR(AB15=\"FAIL\",AC15=\"FAIL\",AD15=\"FAIL\",AE15=\"FAIL\",AF15=\"FAIL\"),\"FAIL\",IF(OR(AB15=\"INC\",AC15=\"INC\",AD15=\"INC\",AE15=\"INC\",AF15=\"INC\"),\"INC\",\"PASS\")))","v":"INC"},"INC",{"$f":"IF(OR(Q15=\"\",R15=\"\"),\"INC\",IF(R15<=Q15,\"PASS\",\"FAIL\"))","v":"INC"},{"$f":"IF(OR(S15=\"\",T15=\"\"),\"INC\",IF(T15<=S15,\"PASS\",\"FAIL\"))","v":"INC"},{"$f":"IF(OR(U15=\"\",V15=\"\"),\"INC\",IF(V15<=U15,\"PASS\",\"FAIL\"))","v":"INC"},{"$f":"IF(OR(W15=\"\",X15=\"\"),\"INC\",IF(X15<=W15,\"PASS\",\"FAIL\"))","v":"INC"}]
[null,null,null,null,"",null,"",null,"",null,null,"",null,"","",null,"",null,"",{"$f":"IF(($Q$10<>\"\")*AND(J16<>\"\")*AND(R16<>\"\"),$Q$10+(J16*R16),\"\")","v":""},"",null,"",null,{"$f":"IF(C16=$V$5,Z16, IF(C16=$V$4,AA16,\"INC\"))","v":"INC"},{"$f":"IF(C16=$V$4,\"\",IF(OR(AB16=\"FAIL\",AC16=\"FAIL\",AD16=\"FAIL\",AE16=\"FAIL\"),\"FAIL\",IF(OR(AB16=\"INC\",AC16=\"INC\",AD16=\"INC\",AE16=\"INC\"),\"INC\",\"PASS\")))","v":"INC"},{"$f":"IF(C16=$V$5,\"\",IF(OR(AB16=\"FAIL\",AC16=\"FAIL\",AD16=\"FAIL\",AE16=\"FAIL\",AF16=\"FAIL\"),\"FAIL\",IF(OR(AB16=\"INC\",AC16=\"INC\",AD16=\"INC\",AE16=\"INC\",AF16=\"INC\"),\"INC\",\"PASS\")))","v":"INC"},"INC",{"$f":"IF(OR(Q16=\"\",R16=\"\"),\"INC\",IF(R16<=Q16,\"PASS\",\"FAIL\"))","v":"INC"},{"$f":"IF(OR(S16=\"\",T16=\"\"),\"INC\",IF(T16<=S16,\"PASS\",\"FAIL\"))","v":"INC"},{"$f":"IF(OR(U16=\"\",V16=\"\"),\"INC\",IF(V16<=U16,\"PASS\",\"FAIL\"))","v":"INC"},{"$f":"IF(OR(W16=\"\",X16=\"\"),\"INC\",IF(X16<=W16,\"PASS\",\"FAIL\"))","v":"INC"}]
[null,null,null,null,"",null,"",null,"",null,null,"",null,"","",null,"",null,"","","",null,"",null,"INC","INC","INC","INC","INC","INC","INC","INC"]
[null,null,null,null,"",null,"",null,"",null,null,"",null,"","",null,"",null,"","","",null,"",null,"INC","INC","INC","INC","INC","INC","INC","INC"]
[null,null,null,null,"",null,"",null,"",null,null,"",null,"","",null,"",null,"","","",null,"",null,"INC","INC","INC","INC","INC","INC","INC","INC"]
[null,null,null,null,"",null,"",null,"",null,null,"",null,"","",null,"",null,"","","",null,"",null,"INC","INC","INC","INC","INC","INC","INC","INC"]
[null,null,null,null,"",null,"",null,"",null,null,"",null,"","",null,"",null,"","","",null,"",null,"INC","INC","INC","INC","INC","INC","INC","INC"]
[null,null,null,null,"",null,"",null,"",null,null,"",null,"","",null,"",null,"","","",null,"",null,"INC","INC","INC","INC","INC","INC","INC","INC"]
[null,null,null,null,"",null,"",null,"",null,null,"",null,"","",null,"",null,"","","",null,"",null,"INC","INC","INC","INC","INC","INC","INC","INC"]
[null,null,null,null,"",null,"",null,"",null,null,"",null,"","",null,"",null,"","","",null,"",null,"INC","INC","INC","INC","INC","INC","INC","INC"]
[null,null,null,null,"",null,"",null,"",null,null,"",null,"","",null,"",null,"","","",null,"",null,"INC","INC","INC","INC","INC","INC","INC","INC"]
[null,null,null,null,"",null,"",null,"",null,null,"",null,"","",null,"",null,"","","",null,"",null,"INC","INC","INC","INC","INC","INC","INC","INC"]
[null,null,null,null,"",null,"",null,"",null,null,"",null,"","",null,"",null,"","","",null,"",null,"INC","INC","INC","INC","INC","INC","INC","INC"]
[null,null,null,null,"",null,"",null,"",null,null,"",null,"","",null,"",null,"","","",null,"",null,"INC","INC","INC","INC","INC","INC","INC","INC"]
[null,null,null,null,"",null,"",null,"",null,null,"",null,"","",null,"",null,"","","",null,"",null,"INC","INC","INC","INC","INC","INC","INC","INC"]
[null,null,null,null,"",null,"",null,"",null,null,"",null,"","",null,"",null,"","","",null,"",null,"INC","INC","INC","INC","INC","INC","INC","INC"]
[null,null,null,null,"",null,"",null,"",null,null,"",null,"","",null,"",null,"","","",null,"",null,"INC","INC","INC","INC","INC","INC","INC","INC"]
[null,null,null,null,"",null,"",null,"",null,null,"",null,"","",null,"",null,"","","",null,"",null,"INC","INC","INC","INC","INC","INC","INC","INC"]
[null,null,null,null,"",null,"",null,"",null,null,"",null,"","",null,"",null,"","","",null,"",null,"INC","INC","INC","INC","INC","INC","INC","INC"]
[null,null,null,null,"",null,"",null,"",null,null,"",null,"","",null,"",null,"","","",null,"",null,"INC","INC","INC","INC","INC","INC","INC","INC"]
[null,null,null,null,"",null,"",null,"",null,null,"",null,"","",null,"",null,"","","",null,"",null,"INC","INC","INC","INC","INC","INC","INC","INC"]
[null,null,null,null,"",null,"",null,"",null,null,"",null,"","",null,"",null,"","","",null,"",null,"INC","INC","INC","INC","INC","INC","INC","INC"]
[null,null,null,null,"",null,"",null,"",null,null,"",null,"","",null,"",null,"","","",null,"",null,"INC","INC","INC","INC","INC","INC","INC","INC"]
[null,null,null,null,"",null,"",null,"",null,null,"",null,"","",null,"",null,"","","",null,"",null,"INC","INC","INC","INC","INC","INC","INC","INC"]
[null,null,null,null,"",null,"",null,"",null,null,"",null,"","",null,"",null,"","","",null,"",null,"INC","INC","INC","INC","INC","INC","INC","INC"]
[null,null,null,null,"",null,"",null,"",null,null,"",null,"","",null,"",null,"","","",null,"",null,"INC","INC","INC","INC","INC","INC","INC","INC"]
[null,null,null,null,"",null,"",null,"",null,null,"",null,"","",null,"",null,"","","",null,"",null,"INC","INC","INC","INC","INC","INC","INC","INC"]
[null,null,null,null,"",null,"",null,"",null,null,"",null,"","",null,"",null,"","","",null,"",null,"INC","INC","INC","INC","INC","INC","INC","INC"]
[null,null,null,null,"",null,"",null,"",null,null,"",null,"","",null,"",null,"","","",null,"",null,"INC","INC","INC","INC","INC","INC","INC","INC"]
[null,null,null,null,"",null,"",null,"",null,null,"",null,"","",null,"",null,"","","",null,"",null,"INC","INC","INC","INC","INC","INC","INC","INC"]
[null,null,null,null,"",null,"",null,"",null,null,"",null,"","",null,"",null,"","","",null,"",null,"INC","INC","INC","INC","INC","INC","INC","INC"]
[null,null,null,null,"",null,"",null,"",null,null,"",null,"","",null,"",null,"","","",null,"",null,"INC","INC","INC","INC","INC","INC","INC","INC"]
[null,null,null,null,"",null,"",null,"",null,null,"",null,"","",null,"",null,"","","",null,"",null,"INC","INC","INC","INC","INC","INC","INC","INC"]
[null,null,null,null,"",null,"",null,"",null,null,"",null,"","",null,"",null,"","","",null,"",null,"INC","INC","INC","INC","INC","INC","INC","INC"]
[null,null,null,null,"",null,"",null,"",null,null,"",null,"","",null,"",null,"","","",null,"",null,"INC","INC","INC","INC","INC","INC","INC","INC"]
[null,null,null,null,"",null,"",null,"",null,null,"",null,"","",null,"",null,"","","",null,"",null,"INC","INC","INC","INC","INC","INC","INC","INC"]
[null,null,null,null,"",null,"",null,"",null,null,"",null,"","",null,"",null,"","","",null,"",null,"INC","INC","INC","INC","INC","INC","INC","INC"]
[null,null,null,null,"",null,"",null,"",null,null,"",null,"","",null,"",null,"","","",null,"",null,"INC","INC","INC","INC","INC","INC","INC","INC"]
[null,null,null,null,"",null,"",null,"",null,null,"",null,"","",null,"",null,"","","",null,"",null,"INC","INC","INC","INC","INC","INC","INC","INC"]
[null,null,null,null,"",null,"",null,"",null,null,"",null,"","",null,"",null,"","","",null,"",null,"INC","INC","INC","INC","INC","INC","INC","INC"]
[null,null,null,null,"",null,"",null,"",null,null,"",null,"","",null,"",null,"","","",null,"",null,"INC","INC","INC","INC","INC","INC","INC","INC"]
[null,null,null,null,"",null,"",null,"",null,null,"",null,"","",null,"",null,"","","",null,"",null,"INC","INC","INC","INC","INC","INC","INC","INC"]
[null,null,null,null,"",null,"",null,"",null,null,"",null,"","",null,"",null,"","","",null,"",null,"INC","INC","INC","INC","INC","INC","INC","INC"]
[null,null,null,null,"",null,"",null,"",null,null,"",null,"","",null,"",null,"","","",null,"",null,"INC","INC","INC","INC","INC","INC","INC","INC"]
[null,null,null,null,"",null,"",null,"",null,null,"",null,"","",null,"",null,"","","",null,"",null,"INC","INC","INC","INC","INC","INC","INC","INC"]
[null,null,null,null,"",null,"",null,"",null,null,"",null,"","",null,"",null,"","","",null,"",null,"INC","INC","INC","INC","INC","INC","INC","INC"]
[null,null,null,null,"",null,"",null,"",null,null,"",null,"","",null,"",null,"","","",null,"",null,"INC","INC","INC","INC","INC","INC","INC","INC"]
[null,null,null,null,"",null,"",null,"",null,null,"",null,"","",null,"",null,"","","",null,"",null,"INC","INC","INC","INC","INC","INC","INC","INC"]
[null,null,null,null,"",null,"",null,"",null,null,"",null,"","",null,"",null,"","","",null,"",null,"INC","INC","INC","INC","INC","INC","INC","INC"]
[null,null,null,null,"",null,"",null,"",null,null,"",null,"","",null,"",null,"","","",null,"",null,"INC","INC","INC","INC","INC","INC","INC","INC"]
[null,null,null,null,"",null,"",null,"",null,null,"",null,"","",null,"",null,"","","",null,"",null,"INC","INC","INC","INC","INC","INC","INC","INC"]
[null,null,null,null,"",null,"",null,"",null,null,"",null,"","",null,"",null,"","","",null,"",null,"INC","INC","INC","INC","INC","INC","INC","INC"]
[null,null,null,null,"",null,"",null,"",null,null,"",null,"","",null,"",null,"","","",null,"",null,"INC","INC","INC","INC","INC","INC","INC","INC"]
[null,null,null,null,"",null,"",null,"",null,null,"",null,"","",null,"",null,"","","",null,"",null,"INC","INC","INC","INC","INC","INC","INC","INC"]
[null,null,null,null,"",null,"",null,"",null,null,"",null,"","",null,"",null,"","","",null,"",null,"INC","INC","INC","INC","INC","INC","INC","INC"]
[null,null,null,null,"",null,"",null,"",null,null,"",null,"","",null,"",null,"","","",null,"",null,"INC","INC","INC","INC","INC","INC","INC","INC"]
[null,null,null,null,"",null,"",null,"",null,null,"",null,"","",null,"",null,"","","",null,"",null,"INC","INC","INC","INC","INC","INC","INC","INC"]
[null,null,null,null,"",null,"",null,"",null,null,"",null,"","",null,"",null,"","","",null,"",null,"INC","INC","INC","INC","INC","INC","INC","INC"]
[null,null,null,null,"",null,"",null,"",null,null,"",null,"","",null,"",null,"","","",null,"",null,"INC","INC","INC","INC","INC","INC","INC","INC"]
[null,null,null,null,"",null,"",null,"",null,null,"",null,"","",null,"",null,"","","",null,"",null,"INC","INC","INC","INC","INC","INC","INC","INC"]
[null,null,null,null,"",null,"",null,"",null,null,"",null,"","",null,"",null,"","","",null,"",null,"INC","INC","INC","INC","INC","INC","INC","INC"]
[null,null,null,null,"",null,"",null,"",null,null,"",null,"","",null,"",null,"","","",null,"",null,"INC","INC","INC","INC","INC","INC","INC","INC"]
[null,null,null,null,"",null,"",null,"",null,null,"",null,"","",null,"",null,"","","",null,"",null,"INC","INC","INC","INC","INC","INC","INC","INC"]
[null,null,null,null,{"$f":" IF(C78=\"Digital\", 0.9, IF(C78=\"Linear\", 0.8, \"\"))","v":""},null,{"$f":"IF(C78=\"Digital\", 0.8, IF(C78=\"Linear\", 0.75, \"\"))","v":""},null,{"$f":"IF(C78=\"Digital\", 0.8, IF(C78=\"Linear\", 0.75, \"\"))","v":""},null,null,"",null,"",{"$f":"IF((D78<>\"\")*AND(E78<>\"\"), IF(ABS(D78)<5,D78,D78*E78),\"\")","v":""},null,{"$f":"IF((F78<>\"\")*AND(G78<>\"\"), F78*G78, \"\")","v":""},null,{"$f":"IF((H78<>\"\")*AND(I78<>\"\"), MIN(H78*I78, (H78-40), 110), \"\")","v":""},"","",null,"",null,"INC","INC","INC",{"$f":"IF(OR(O78=\"\",P78=\"\"),\"INC\",IF(ABS(P78)<=ABS(O78),\"PASS\",\"FAIL\"))","v":"INC"},"INC","INC","INC","INC"]
[null,null,null,null,"",null,"",null,"",null,null,{"$f":"IF(K79<>\"\",0.8,\"\")","v":""},null,{"$f":"IF(M79<>\"\",0.8,\"\")","v":""},"",null,"",null,"","",{"$f":"IF(K79<>\"\", K79*L79, \"\")","v":""},null,{"$f":"IF(M79<>\"\", M79*N79, \"\")","v":""},null,"INC","INC","INC","INC","INC","INC","INC","INC"]
[null,null,null,null,"",null,"",null,"",null,null,"",null,"","",null,"",null,"",{"$f":"IF(($Q$10<>\"\")*AND(J80<>\"\")*AND(R80<>\"\"),$Q$10+(J80*R80),\"\")","v":""},"",null,"",null,{"$f":"IF(C80=$V$5,Z80, IF(C80=$V$4,AA80,\"INC\"))","v":"INC"},{"$f":"IF(C80=$V$4,\"\",IF(OR(AB80=\"FAIL\",AC80=\"FAIL\",AD80=\"FAIL\",AE80=\"FAIL\"),\"FAIL\",IF(OR(AB80=\"INC\",AC80=\"INC\",AD80=\"INC\",AE80=\"INC\"),\"INC\",\"PASS\")))","v":"INC"},{"$f":"IF(C80=$V$5,\"\",IF(OR(AB80=\"FAIL\",AC80=\"FAIL\",AD80=\"FAIL\",AE80=\"FAIL\",AF80=\"FAIL\"),\"FAIL\",IF(OR(AB80=\"INC\",AC80=\"INC\",AD80=\"INC\",AE80=\"INC\",AF80=\"INC\"),\"INC\",\"PASS\")))","v":"INC"},"INC",{"$f":"IF(OR(Q80=\"\",R80=\"\"),\"INC\",IF(R80<=Q80,\"PASS\",\"FAIL\"))","v":"INC"},{"$f":"IF(OR(S80=\"\",T80=\"\"),\"INC\",IF(T80<=S80,\"PASS\",\"FAIL\"))","v":"INC"},{"$f":"IF(OR(U80=\"\",V80=\"\"),\"INC\",IF(V80<=U80,\"PASS\",\"FAIL\"))","v":"INC"},{"$f":"IF(OR(W80=\"\",X80=\"\"),\"INC\",IF(X80<=W80,\"PASS\",\"FAIL\"))","v":"INC"}]
[null,null,null,null,"",null,"",null,"",null,null,"",null,"","",null,"",null,"","","",null,"",null,"INC","INC","INC","INC","INC","INC","INC","INC"]
[null,null,null,null,"",null,"",null,"",null,null,"",null,"","",null,"",null,"","","",null,"",null,"INC","INC","INC","INC","INC","INC","INC","INC"]
[null,null,null,null,"",null,"",null,"",null,null,"",null,"","",null,"",null,"","","",null,"",null,"INC","INC","INC","INC","INC","INC","INC","INC"]
[null,null,null,null,"",null,"",null,"",null,null,"",null,"","",null,"",null,"","","",null,"",null,"INC","INC","INC","INC","INC","INC","INC","INC"]
[null,null,null,null,"",null,"",null,"",null,null,"",null,"","",null,"",null,"","","",null,"",null,"INC","INC","INC","INC","INC","INC","INC","INC"]
[null,null,null,null,"",null,"",null,"",null,null,"",null,"","",null,"",null,"","","",null,"",null,"INC","INC","INC","INC","INC","INC","INC","INC"]
[null,null,null,null,"",null,"",null,"",null,null,"",null,"","",null,"",null,"","","",null,"",null,"INC","INC","INC","INC","INC","INC","INC","INC"]
[null,null,null,null,"",null,"",null,"",null,null,"",null,"","",null,"",null,"","","",null,"",null,"INC","INC","INC","INC","INC","INC","INC","INC"]
[null,null,null,null,"",null,"",null,"",null,null,"",null,"","",null,"",null,"","","",null,"",null,"INC","INC","INC","INC","INC","INC","INC","INC"]
[null,null,null,null,"",null,"",null,"",null,null,"",null,"","",null,"",null,"","","",null,"",null,"INC","INC","INC","INC","INC","INC","INC","INC"]
[null,null,null,null,"",null,"",null,"",null,null,"",null,"","",null,"",null,"","","",null,"",null,"INC","INC","INC","INC","INC","INC","INC","INC"]
[null,null,null,null,"",null,"",null,"",null,null,"",null,"","",null,"",null,"","","",null,"",null,"INC","INC","INC","INC","INC","INC","INC","INC"]
[null,null,null,null,"",null,"",null,"",null,null,"",null,"","",null,"",null,"","","",null,"",null,"INC","INC","INC","INC","INC","INC","INC","INC"]
[null,null,null,null,"",null,"",null,"",null,null,"",null,"","",null,"",null,"","","",null,"",null,"INC","INC","INC","INC","INC","INC","INC","INC"]
[null,null,null,null,"",null,"",null,"",null,null,"",null,"","",null,"",null,"","","",null,"",null,"INC","INC","INC","INC","INC","INC","INC","INC"]
[null,null,null,null,"",null,"",null,"",null,null,"",null,"","",null,"",null,"","","",null,"",null,"INC","INC","INC","INC","INC","INC","INC","INC"]
[null,null,null,null,"",null,"",null,"",null,null,"",null,"","",null,"",null,"","","",null,"",null,"INC","INC","INC","INC","INC","INC","INC","INC"]
[null,null,null,null,"",null,"",null,"",null,null,"",null,"","",null,"",null,"","","",null,"",null,"INC","INC","INC","INC","INC","INC","INC","INC"]
[null,null,null,null,"",null,"",null,"",null,null,"",null,"","",null,"",null,"","","",null,"",null,"INC","INC","INC","INC","INC","INC","INC","INC"]
[null,null,null,null,"",null,"",null,"",null,null,"",null,"","",null,"",null,"","","",null,"",null,"INC","INC","INC","INC","INC","INC","INC","INC"]
[null,null,null,null,"",null,"",null,"",null,null,"",null,"","",null,"",null,"","","",null,"",null,"INC","INC","INC","INC","INC","INC","INC","INC"]
[null,null,null,null,"",null,"",null,"",null,null,"",null,"","",null,"",null,"","","",null,"",null,"INC","INC","INC","INC","INC","INC","INC","INC"]
[null,null,null,null,"",null,"",null,"",null,null,"",null,"","",null,"",null,"","","",null,"",null,"INC","INC","INC","INC","INC","INC","INC","INC"]
[null,null,null,null,"",null,"",null,"",null,null,"",null,"","",null,"",null,"","","",null,"",null,"INC","INC","INC","INC","INC","INC","INC","INC"]
[null,null,null,null,"",null,"",null,"",null,null,"",null,"","",null,"",null,"","","",null,"",null,"INC","INC","INC","INC","INC","INC","INC","INC"]
[null,null,null,null,"",null,"",null,"",null,null,"",null,"","",null,"",null,"","","",null,"",null,"INC","INC","INC","INC","INC","INC","INC","INC"]
[null,null,null,null,"",null,"",null,"",null,null,"",null,"","",null,"",null,"","","",null,"",null,"INC","INC","INC","INC","INC","INC","INC","INC"]
[null,null,null,null,"",null,"",null,"",null,null,"",null,"","",null,"",null,"","","",null,"",null,"INC","INC","INC","INC","INC","INC","INC","INC"]
[null,null,null,null,"",null,"",null,"",null,null,"",null,"","",null,"",null,"","","",null,"",null,"INC","INC","INC","INC","INC","INC","INC","INC"]
[null,null,null,null,"",null,"",null,"",null,null,"",null,"","",null,"",null,"","","",null,"",null,"INC","INC","INC","INC","INC","INC","INC","INC"]
[null,null,null,null,"",null,"",null,"",null,null,"",null,"","",null,"",null,"","","",null,"",null,"INC","INC","INC","INC","INC","INC","INC","INC"]
[null,null,null,null,"",null,"",null,"",null,null,"",null,"","",null,"",null,"","","",null,"",null,"INC","INC","INC","INC","INC","INC","INC","INC"]
[null,null,null,null,"",null,"",null,"",null,null,"",null,"","",null,"",null,"","","",null,"",null,"INC","INC","INC","INC","INC","INC","INC","INC"]
[null,null,null,null,"",null,"",null,"",null,null,"",null,"","",null,"",null,"","","",null,"",null,"INC","INC","INC","INC","INC","INC","INC","INC"]
[null,null,null,null,"",null,"",null,"",null,null,"",null,"","",null,"",null,"","","",null,"",null,"INC","INC","INC","INC","INC","INC","INC","INC"]
[null,null,null,null,"",null,"",null,"",null,null,"",null,"","",null,"",null,"","","",null,"",null,"INC","INC","INC","INC","INC","INC","INC","INC"]
[null,null,null,null,"",null,"",null,"",null,null,"",null,"","",null,"",null,"","","",null,"",null,"INC","INC","INC","INC","INC","INC","INC","INC"]
[null,null,null,null,"",null,"",null,"",null,null,"",null,"","",null,"",null,"","","",null,"",null,"INC","INC","INC","INC","INC","INC","INC","INC"]
[null,null,null,null,"",null,"",null,"",null,null,"",null,"","",null,"",null,"","","",null,"",null,"INC","INC","INC","INC","INC","INC","INC","INC"]
[null,null,null,null,"",null,"",null,"",null,null,"",null,"","",null,"",null,"","","",null,"",null,"INC","INC","INC","INC","INC","INC","INC","INC"]
[null,null,null,null,"",null,"",null,"",null,null,"",null,"","",null,"",null,"","","",null,"",null,"INC","INC","INC","INC","INC","INC","INC","INC"]
[null,null,null,null,"",null,"",null,"",null,null,"",null,"","",null,"",null,"","","",null,"",null,"INC","INC","INC","INC","INC","INC","INC","INC"]
[null,null,null,null,"",null,"",null,"",null,null,"",null,"","",null,"",null,"","","",null,"",null,"INC","INC","INC","INC","INC","INC","INC","INC"]
[null,null,null,null,"",null,"",null,"",null,null,"",null,"","",null,"",null,"","","",null,"",null,"INC","INC","INC","INC","INC","INC","INC","INC"]
[null,null,null,null,"",null,"",null,"",null,null,"",null,"","",null,"",null,"","","",null,"",null,"INC","INC","INC","INC","INC","INC","INC","INC"]
[null,null,null,null,"",null,"",null,"",null,null,"",null,"","",null,"",null,"","","",null,"",null,"INC","INC","INC","INC","INC","INC","INC","INC"]
[null,null,null,null,"",null,"",null,"",null,null,"",null,"","",null,"",null,"","","",null,"",null,"INC","INC","INC","INC","INC","INC","INC","INC"]
[null,null,null,null,"",null,"",null,"",null,null,"",null,"","",null,"",null,"","","",null,"",null,"INC","INC","INC","INC","INC","INC","INC","INC"]
[null,null,null,null,"",null,"",null,"",null,null,"",null,"","",null,"",null,"","","",null,"",null,"INC","INC","INC","INC","INC","INC","INC","INC"]
[null,null,null,null,"",null,"",null,"",null,null,"",null,"","",null,"",null,"","","",null,"",null,"INC","INC","INC","INC","INC","INC","INC","INC"]
[null,null,null,null,"",null,"",null,"",null,null,"",null,"","",null,"",null,"","","",null,"",null,"INC","INC","INC","INC","INC","INC","INC","INC"]
[null,null,null,null,"",null,"",null,"",null,null,"",null,"","",null,"",null,"","","",null,"",null,"INC","INC","INC","INC","INC","INC","INC","INC"]
[null,null,null,null,"",null,"",null,"",null,null,"",null,"","",null,"",null,"","","",null,"",null,"INC","INC","INC","INC","INC","INC","INC","INC"]
[null,null,null,null,"",null,"",null,"",null,null,"",null,"","",null,"",null,"","","",null,"",null,"INC","INC","INC","INC","INC","INC","INC","INC"]
[null,null,null,null,"",null,"",null,"",null,null,"",null,"","",null,"",null,"","","",null,"",null,"INC","INC","INC","INC","INC","INC","INC","INC"]
[null,null,null,null,"",null,"",null,"",null,null,"",null,"","",null,"",null,"","","",null,"",null,"INC","INC","INC","INC","INC","INC","INC","INC"]
[null,null,null,null,"",null,"",null,"",null,null,"",null,"","",null,"",null,"","","",null,"",null,"INC","INC","INC","INC","INC","INC","INC","INC"]
[null,null,null,null,"",null,"",null,"",null,null,"",null,"","",null,"",null,"","","",null,"",null,"INC","INC","INC","INC","INC","INC","INC","INC"]
[null,null,null,null,"",null,"",null,"",null,null,"",null,"","",null,"",null,"","","",null,"",null,"INC","INC","INC","INC","INC","INC","INC","INC"]
[null,null,null,null,"",null,"",null,"",null,null,"",null,"","",null,"",null,"","","",null,"",null,"INC","INC","INC","INC","INC","INC","INC","INC"]
[null,null,null,null,"",null,"",null,"",null,null,"",null,"","",null,"",null,"","","",null,"",null,"INC","INC","INC","INC","INC","INC","INC","INC"]
[null,null,null,null,{"$f":" IF(C142=\"Digital\", 0.9, IF(C142=\"Linear\", 0.8, \"\"))","v":""},null,{"$f":"IF(C142=\"Digital\", 0.8, IF(C142=\"Linear\", 0.75, \"\"))","v":""},null,{"$f":"IF(C142=\"Digital\", 0.8, IF(C142=\"Linear\", 0.75, \"\"))","v":""},null,null,"",null,"",{"$f":"IF((D142<>\"\")*AND(E142<>\"\"), IF(ABS(D142)<5,D142,D142*E142),\"\")","v":""},null,{"$f":"IF((F142<>\"\")*AND(G142<>\"\"), F142*G142, \"\")","v":""},null,{"$f":"IF((H142<>\"\")*AND(I142<>\"\"), MIN(H142*I142, (H142-40), 110), \"\")","v":""},"","",null,"",null,"INC","INC","INC",{"$f":"IF(OR(O142=\"\",P142=\"\"),\"INC\",IF(ABS(P142)<=ABS(O142),\"PASS\",\"FAIL\"))","v":"INC"},"INC","INC","INC","INC"]
[null,null,null,null,"",null,"",null,"",null,null,{"$f":"IF(K143<>\"\",0.8,\"\")","v":""},null,{"$f":"IF(M143<>\"\",0.8,\"\")","v":""},"",null,"",null,"","",{"$f":"IF(K143<>\"\", K143*L143, \"\")","v":""},null,{"$f":"IF(M143<>\"\", M143*N143, \"\")","v":""},null,"INC","INC","INC","INC","INC","INC","INC","INC"]
[null,null,null,null,"",null,"",null,"",null,null,"",null,"","",null,"",null,"",{"$f":"IF(($Q$10<>\"\")*AND(J144<>\"\")*AND(R144<>\"\"),$Q$10+(J144*R144),\"\")","v":""},"",null,"",null,{"$f":"IF(C144=$V$5,Z144, IF(C144=$V$4,AA144,\"INC\"))","v":"INC"},{"$f":"IF(C144=$V$4,\"\",IF(OR(AB144=\"FAIL\",AC144=\"FAIL\",AD144=\"FAIL\",AE144=\"FAIL\"),\"FAIL\",IF(OR(AB144=\"INC\",AC144=\"INC\",AD144=\"INC\",AE144=\"INC\"),\"INC\",\"PASS\")))","v":"INC"},{"$f":"IF(C144=$V$5,\"\",IF(OR(AB144=\"FAIL\",AC144=\"FAIL\",AD144=\"FAIL\",AE144=\"FAIL\",AF144=\"FAIL\"),\"FAIL\",IF(OR(AB144=\"INC\",AC144=\"INC\",AD144=\"INC\",AE144=\"INC\",AF144=\"INC\"),\"INC\",\"PASS\")))","v":"INC"},"INC",{"$f":"IF(OR(Q144=\"\",R144=\"\"),\"INC\",IF(R144<=Q144,\"PASS\",\"FAIL\"))","v":"INC"},{"$f":"IF(OR(S144=\"\",T144=\"\"),\"INC\",IF(T144<=S144,\"PASS\",\"FAIL\"))","v":"INC"},{"$f":"IF(OR(U144=\"\",V144=\"\"),\"INC\",IF(V144<=U144,\"PASS\",\"FAIL\"))","v":"INC"},{"$f":"IF(OR(W144=\"\",X144=\"\"),\"INC\",IF(X144<=W144,\"PASS\",\"FAIL\"))","v":"INC"}]
[null,null,null,null,"",null,"",null,"",null,null,"",null,"","",null,"",null,"","","",null,"",null,"INC","INC","INC","INC","INC","INC","INC","INC"]
[null,null,null,null,"",null,"",null,"",null,null,"",null,"","",null,"",null,"","","",null,"",null,"INC","INC","INC","INC","INC","INC","INC","INC"]
[null,null,null,null,"",null,"",null,"",null,null,"",null,"","",null,"",null,"","","",null,"",null,"INC","INC","INC","INC","INC","INC","INC","INC"]
[null,null,null,null,"",null,"",null,"",null,null,"",null,"","",null,"",null,"","","",null,"",null,"INC","INC","INC","INC","INC","INC","INC","INC"]
[null,null,null,null,"",null,"",null,"",null,null,"",null,"","",null,"",null,"","","",null,"",null,"INC","INC","INC","INC","INC","INC","INC","INC"]
[null,null,null,null,"",null,"",null,"",null,null,"",null,"","",null,"",null,"","","",null,"",null,"INC","INC","INC","INC","INC","INC","INC","INC"]
[null,null,null,null,"",null,"",null,"",null,null,"",null,"","",null,"",null,"","","",null,"",null,"INC","INC","INC","INC","INC","INC","INC","INC"]
[null,null,null,null,"",null,"",null,"",null,null,"",null,"","",null,"",null,"","","",null,"",null,"INC","INC","INC","INC","INC","INC","INC","INC"]
[null,null,null,null,"",null,"",null,"",null,null,"",null,"","",null,"",null,"","","",null,"",null,"INC","INC","INC","INC","INC","INC","INC","INC"]
[null,null,null,null,"",null,"",null,"",null,null,"",null,"","",null,"",null,"","","",null,"",null,"INC","INC","INC","INC","INC","INC","INC","INC"]
[null,null,null,null,"",null,"",null,"",null,null,"",null,"","",null,"",null,"","","",null,"",null,"INC","INC","INC","INC","INC","INC","INC","INC"]
[null,null,null,null,"",null,"",null,"",null,null,"",null,"","",null,"",null,"","","",null,"",null,"INC","INC","INC","INC","INC","INC","INC","INC"]
[null,null,null,null,"",null,"",null,"",null,null,"",null,"","",null,"",null,"","","",null,"",null,"INC","INC","INC","INC","INC","INC","INC","INC"]
[null,null,null,null,"",null,"",null,"",null,null,"",null,"","",null,"",null,"","","",null,"",null,"INC","INC","INC","INC","INC","INC","INC","INC"]
[null,null,null,null,"",null,"",null,"",null,null,"",null,"","",null,"",null,"","","",null,"",null,"INC","INC","INC","INC","INC","INC","INC","INC"]
[null,null,null,null,"",null,"",null,"",null,null,"",null,"","",null,"",null,"","","",null,"",null,"INC","INC","INC","INC","INC","INC","INC","INC"]
[null,null,null,null,"",null,"",null,"",null,null,"",null,"","",null,"",null,"","","",null,"",null,"INC","INC","INC","INC","INC","INC","INC","INC"]
[null,null,null,null,"",null,"",null,"",null,null,"",null,"","",null,"",null,"","","",null,"",null,"INC","INC","INC","INC","INC","INC","INC","INC"]
[null,null,null,null,"",null,"",null,"",null,null,"",null,"","",null,"",null,"","","",null,"",null,"INC","INC","INC","INC","INC","INC","INC","INC"]
[null,null,null,null,"",null,"",null,"",null,null,"",null,"","",null,"",null,"","","",null,"",null,"INC","INC","INC","INC","INC","INC","INC","INC"]
[null,null,null,null,"",null,"",null,"",null,null,"",null,"","",null,"",null,"","","",null,"",null,"INC","INC","INC","INC","INC","INC","INC","INC"]
[null,null,null,null,"",null,"",null,"",null,null,"",null,"","",null,"",null,"","","",null,"",null,"INC","INC","INC","INC","INC","INC","INC","INC"]
[null,null,null,null,"",null,"",null,"",null,null,"",null,"","",null,"",null,"","","",null,"",null,"INC","INC","INC","INC","INC","INC","INC","INC"]
[null,null,null,null,"",null,"",null,"",null,null,"",null,"","",null,"",null,"","","",null,"",null,"INC","INC","INC","INC","INC","INC","INC","INC"]
[null,null,null,null,"",null,"",null,"",null,null,"",null,"","",null,"",null,"","","",null,"",null,"INC","INC","INC","INC","INC","INC","INC","INC"]
[null,null,null,null,"",null,"",null,"",null,null,"",null,"","",null,"",null,"","","",null,"",null,"INC","INC","INC","INC","INC","INC","INC","INC"]
[null,null,null,null,"",null,"",null,"",null,null,"",null,"","",null,"",null,"","","",null,"",null,"INC","INC","INC","INC","INC","INC","INC","INC"]
[null,null,null,null,"",null,"",null,"",null,null,"",null,"","",null,"",null,"","","",null,"",null,"INC","INC","INC","INC","INC","INC","INC","INC"]
[null,null,null,null,"",null,"",null,"",null,null,"",null,"","",null,"",null,"","","",null,"",null,"INC","INC","INC","INC","INC","INC","INC","INC"]
[null,null,null,null,"",null,"",null,"",null,null,"",null,"","",null,"",null,"","","",null,"",null,"INC","INC","INC","INC","INC","INC","INC","INC"]
[null,null,null,null,"",null,"",null,"",null,null,"",null,"","",null,"",null,"","","",null,"",null,"INC","INC","INC","INC","INC","INC","INC","INC"]
[null,null,null,null,"",null,"",null,"",null,null,"",null,"","",null,"",null,"","","",null,"",null,"INC","INC","INC","INC","INC","INC","INC","INC"]
[null,null,null,null,"",null,"",null,"",null,null,"",null,"","",null,"",null,"","","",null,"",null,"INC","INC","INC","INC","INC","INC","INC","INC"]
[null,null,null,null,"",null,"",null,"",null,null,"",null,"","",null,"",null,"","","",null,"",null,"INC","INC","INC","INC","INC","INC","INC","INC"]
[null,null,null,null,"",null,"",null,"",null,null,"",null,"","",null,"",null,"","","",null,"",null,"INC","INC","INC","INC","INC","INC","INC","INC"]
[null,null,null,null,"",null,"",null,"",null,null,"",null,"","",null,"",null,"","","",null,"",null,"INC","INC","INC","INC","INC","INC","INC","INC"]
[null,null,null,null,"",null,"",null,"",null,null,"",null,"","",null,"",null,"","","",null,"",null,"INC","INC","INC","INC","INC","INC","INC","INC"]
[null,null,null,null,"",null,"",null,"",null,null,"",null,"","",null,"",null,"","","",null,"",null,"INC","INC","INC","INC","INC","INC","INC","INC"]
[null,null,null,null,"",null,"",null,"",null,null,"",null,"","",null,"",null,"","","",null,"",null,"INC","INC","INC","INC","INC","INC","INC","INC"]
[null,null,null,null,"",null,"",null,"",null,null,"",null,"","",null,"",null,"","","",null,"",null,"INC","INC","INC","INC","INC","INC","INC","INC"]
[null,null,null,null,"",null,"",null,"",null,null,"",null,"","",null,"",null,"","","",null,"",null,"INC","INC","INC","INC","INC","INC","INC","INC"]
[null,null,null,null,"",null,"",null,"",null,null,"",null,"","",null,"",null,"","","",null,"",null,"INC","INC","INC","INC","INC","INC","INC","INC"]
[null,null,null,null,"",null,"",null,"",null,null,"",null,"","",null,"",null,"","","",null,"",null,"INC","INC","INC","INC","INC","INC","INC","INC"]
[null,null,null,null,"",null,"",null,"",null,null,"",null,"","",null,"",null,"","","",null,"",null,"INC","INC","INC","INC","INC","INC","INC","INC"]
[null,null,null,null,"",null,"",null,"",null,null,"",null,"","",null,"",null,"","","",null,"",null,"INC","INC","INC","INC","INC","INC","INC","INC"]
[null,null,null,null,"",null,"",null,"",null,null,"",null,"","",null,"",null,"","","",null,"",null,"INC","INC","INC","INC","INC","INC","INC","INC"]
[null,null,null,null,"",null,"",null,"",null,null,"",null,"","",null,"",null,"","","",null,"",null,"INC","INC","INC","INC","INC","INC","INC","INC"]
[null,null,null,null,"",null,"",null,"",null,null,"",null,"","",null,"",null,"","","",null,"",null,"INC","INC","INC","INC","INC","INC","INC","INC"]
[null,null,null,null,"",null,"",null,"",null,null,"",null,"","",null,"",null,"","","",null,"",null,"INC","INC","INC","INC","INC","INC","INC","INC"]
[null,null,null,null,"",null,"",null,"",null,null,"",null,"","",null,"",null,"","","",null,"",null,"INC","INC","INC","INC","INC","INC","INC","INC"]
[null,null,null,null,"",null,"",null,"",null,null,"",null,"","",null,"",null,"","","",null,"",null,"INC","INC","INC","INC","INC","INC","INC","INC"]
[null,null,null,null,"",null,"",null,"",null,null,"",null,"","",null,"",null,"","","",null,"",null,"INC","INC","INC","INC","INC","INC","INC","INC"]
[null,null,null,null,"",null,"",null,"",null,null,"",null,"","",null,"",null,"","","",null,"",null,"INC","INC","INC","INC","INC","INC","INC","INC"]
[null,null,null,null,"",null,"",null,"",null,null,"",null,"","",null,"",null,"","","",null,"",null,"INC","INC","INC","INC","INC","INC","INC","INC"]
[null,null,null,null,"",null,"",null,"",null,null,"",null,"","",null,"",null,"","","",null,"",null,"INC","INC","INC","INC","INC","INC","INC","INC"]
[null,null,null,null,"",null,"",null,"",null,null,"",null,"","",null,"",null,"","","",null,"",null,"INC","INC","INC","INC","INC","INC","INC","INC"]
[null,null,null,null,"",null,"",null,"",null,null,"",null,"","",null,"",null,"","","",null,"",null,"INC","INC","INC","INC","INC","INC","INC","INC"]
[null,null,null,null,"",null,"",null,"",null,null,"",null,"","",null,"",null,"","","",null,"",null,"INC","INC","INC","INC","INC","INC","INC","INC"]
[null,null,null,null,"",null,"",null,"",null,null,"",null,"","",null,"",null,"","","",null,"",null,"INC","INC","INC","INC","INC","INC","INC","INC"]
[null,null,null,null,"",null,"",null,"",null,null,"",null,"","",null,"",null,"","","",null,"",null,"INC","INC","INC","INC","INC","INC","INC","INC"]
[null,null,null,null,"",null,"",null,"",null,null,"",null,"","",null,"",null,"","","",null,"",null,"INC","INC","INC","INC","INC","INC","INC","INC"]
[null,null,null,null,{"$f":" IF(C206=\"Digital\", 0.9, IF(C206=\"Linear\", 0.8, \"\"))","v":""},null,{"$f":"IF(C206=\"Digital\", 0.8, IF(C206=\"Linear\", 0.75, \"\"))","v":""},null,{"$f":"IF(C206=\"Digital\", 0.8, IF(C206=\"Linear\", 0.75, \"\"))","v":""},null,null,"",null,"",{"$f":"IF((D206<>\"\")*AND(E206<>\"\"), IF(ABS(D206)<5,D206,D206*E206),\"\")","v":""},null,{"$f":"IF((F206<>\"\")*AND(G206<>\"\"), F206*G206, \"\")","v":""},null,{"$f":"IF((H206<>\"\")*AND(I206<>\"\"), MIN(H206*I206, (H206-40), 110), \"\")","v":""},"","",null,"",null,"INC","INC","INC",{"$f":"IF(OR(O206=\"\",P206=\"\"),\"INC\",IF(ABS(P206)<=ABS(O206),\"PASS\",\"FAIL\"))","v":"INC"},"INC","INC","INC","INC"]
[null,null,null,null,"",null,"",null,"",null,null,{"$f":"IF(K207<>\"\",0.8,\"\")","v":""},null,{"$f":"IF(M207<>\"\",0.8,\"\")","v":""},"",null,"",null,"","",{"$f":"IF(K207<>\"\", K207*L207, \"\")","v":""},null,{"$f":"IF(M207<>\"\", M207*N207, \"\")","v":""},null,"INC","INC","INC","INC","INC","INC","INC","INC"]
[null,null,null,null,"",null,"",null,"",null,null,"",null,"","",null,"",null,"",{"$f":"IF(($Q$10<>\"\")*AND(J208<>\"\")*AND(R208<>\"\"),$Q$10+(J208*R208),\"\")","v":""},"",null,"",null,{"$f":"IF(C208=$V$5,Z208, IF(C208=$V$4,AA208,\"INC\"))","v":"INC"},{"$f":"IF(C208=$V$4,\"\",IF(OR(AB208=\"FAIL\",AC208=\"FAIL\",AD208=\"FAIL\",AE208=\"FAIL\"),\"FAIL\",IF(OR(AB208=\"INC\",AC208=\"INC\",AD208=\"INC\",AE208=\"INC\"),\"INC\",\"PASS\")))","v":"INC"},{"$f":"IF(C208=$V$5,\"\",IF(OR(AB208=\"FAIL\",AC208=\"FAIL\",AD208=\"FAIL\",AE208=\"FAIL\",AF208=\"FAIL\"),\"FAIL\",IF(OR(AB208=\"INC\",AC208=\"INC\",AD208=\"INC\",AE208=\"INC\",AF208=\"INC\"),\"INC\",\"PASS\")))","v":"INC"},"INC",{"$f":"IF(OR(Q208=\"\",R208=\"\"),\"INC\",IF(R208<=Q208,\"PASS\",\"FAIL\"))","v":"INC"},{"$f":"IF(OR(S208=\"\",T208=\"\"),\"INC\",IF(T208<=S208,\"PASS\",\"FAIL\"))","v":"INC"},{"$f":"IF(OR(U208=\"\",V208=\"\"),\"INC\",IF(V208<=U208,\"PASS\",\"FAIL\"))","v":"INC"},{"$f":"IF(OR(W208=\"\",X208=\"\"),\"INC\",IF(X208<=W208,\"PASS\",\"FAIL\"))","v":"INC"}]
[null,null,null,null,"",null,"",null,"",null,null,"",null,"","",null,"",null,"","","",null,"",null,"INC","INC","INC","INC","INC","INC","INC","INC"]
[null,null,null,null,"",null,"",null,"",null,null,"",null,"","",null,"",null,"","","",null,"",null,"INC","INC","INC","INC","INC","INC","INC","INC"]
[null,null,null,null,"",null,"",null,"",null,null,"",null,"","",null,"",null,"","","",null,"",null,"INC","INC","INC","INC","INC","INC","INC","INC"]
[null,null,null,null,"",null,"",null,"",null,null,"",null,"","",null,"",null,"","","",null,"",null,"INC","INC","INC","INC","INC","INC","INC","INC"]
[null,null,null,null,"",null,"",null,"",null,null,"",null,"","",null,"",null,"","","",null,"",null,"INC","INC","INC","INC","INC","INC","INC","INC"]
[null,null,null,null,"",null,"",null,"",null,null,"",null,"","",null,"",null,"","","",null,"",null,"INC","INC","INC","INC","INC","INC","INC","INC"]
[null,null,null,null,"",null,"",null,"",null,null,"",null,"","",null,"",null,"","","",null,"",null,"INC","INC","INC","INC","INC","INC","INC","INC"]
[null,null,null,null,"",null,"",null,"",null,null,"",null,"","",null,"",null,"","","",null,"",null,"INC","INC","INC","INC","INC","INC","INC","INC"]
[null,null,null,null,"",null,"",null,"",null,null,"",null,"","",null,"",null,"","","",null,"",null,"INC","INC","INC","INC","INC","INC","INC","INC"]
[null,null,null,null,"",null,"",null,"",null,null,"",null,"","",null,"",null,"","","",null,"",null,"INC","INC","INC","INC","INC","INC","INC","INC"]
[null,null,null,null,"",null,"",null,"",null,null,"",null,"","",null,"",null,"","","",null,"",null,"INC","INC","INC","INC","INC","INC","INC","INC"]
[null,null,null,null,"",null,"",null,"",null,null,"",null,"","",null,"",null,"","","",null,"",null,"INC","INC","INC","INC","INC","INC","INC","INC"]
[null,null,null,null,"",null,"",null,"",null,null,"",null,"","",null,"",null,"","","",null,"",null,"INC","INC","INC","INC","INC","INC","INC","INC"]
[null,null,null,null,"",null,"",null,"",null,null,"",null,"","",null,"",null,"","","",null,"",null,"INC","INC","INC","INC","INC","INC","INC","INC"]
[null,null,null,null,"",null,"",null,"",null,null,"",null,"","",null,"",null,"","","",null,"",null,"INC","INC","INC","INC","INC","INC","INC","INC"]
[null,null,null,null,"",null,"",null,"",null,null,"",null,"","",null,"",null,"","","",null,"",null,"INC","INC","INC","INC","INC","INC","INC","INC"]
[null,null,null,null,"",null,"",null,"",null,null,"",null,"","",null,"",null,"","","",null,"",null,"INC","INC","INC","INC","INC","INC","INC","INC"]
[null,null,null,null,"",null,"",null,"",null,null,"",null,"","",null,"",null,"","","",null,"",null,"INC","INC","INC","INC","INC","INC","INC","INC"]
[null,null,null,null,"",null,"",null,"",null,null,"",null,"","",null,"",null,"","","",null,"",null,"INC","INC","INC","INC","INC","INC","INC","INC"]
[null,null,null,null,"",null,"",null,"",null,null,"",null,"","",null,"",null,"","","",null,"",null,"INC","INC","INC","INC","INC","INC","INC","INC"]
[null,null,null,null,"",null,"",null,"",null,null,"",null,"","",null,"",null,"","","",null,"",null,"INC","INC","INC","INC","INC","INC","INC","INC"]
[null,null,null,null,"",null,"",null,"",null,null,"",null,"","",null,"",null,"","","",null,"",null,"INC","INC","INC","INC","INC","INC","INC","INC"]
[null,null,null,null,"",null,"",null,"",null,null,"",null,"","",null,"",null,"","","",null,"",null,"INC","INC","INC","INC","INC","INC","INC","INC"]
[null,null,null,null,"",null,"",null,"",null,null,"",null,"","",null,"",null,"","","",null,"",null,"INC","INC","INC","INC","INC","INC","INC","INC"]
[null,null,null,null,"",null,"",null,"",null,null,"",null,"","",null,"",null,"","","",null,"",null,"INC","INC","INC","INC","INC","INC","INC","INC"]
[null,null,null,null,"",null,"",null,"",null,null,"",null,"","",null,"",null,"","","",null,"",null,"INC","INC","INC","INC","INC","INC","INC","INC"]
[null,null,null,null,"",null,"",null,"",null,null,"",null,"","",null,"",null,"","","",null,"",null,"INC","INC","INC","INC","INC","INC","INC","INC"]
[null,null,null,null,"",null,"",null,"",null,null,"",null,"","",null,"",null,"","","",null,"",null,"INC","INC","INC","INC","INC","INC","INC","INC"]
[null,null,null,null,"",null,"",null,"",null,null,"",null,"","",null,"",null,"","","",null,"",null,"INC","INC","INC","INC","INC","INC","INC","INC"]
[null,null,null,null,"",null,"",null,"",null,null,"",null,"","",null,"",null,"","","",null,"",null,"INC","INC","INC","INC","INC","INC","INC","INC"]
[null,null,null,null,"",null,"",null,"",null,null,"",null,"","",null,"",null,"","","",null,"",null,"INC","INC","INC","INC","INC","INC","INC","INC"]
[null,null,null,null,"",null,"",null,"",null,null,"",null,"","",null,"",null,"","","",null,"",null,"INC","INC","INC","INC","INC","INC","INC","INC"]
[null,null,null,null,"",null,"",null,"",null,null,"",null,"","",null,"",null,"","","",null,"",null,"INC","INC","INC","INC","INC","INC","INC","INC"]
[null,null,null,null,"",null,"",null,"",null,null,"",null,"","",null,"",null,"","","",null,"",null,"INC","INC","INC","INC","INC","INC","INC","INC"]
[null,null,null,null,"",null,"",null,"",null,null,"",null,"","",null,"",null,"","","",null,"",null,"INC","INC","INC","INC","INC","INC","INC","INC"]
[null,null,null,null,"",null,"",null,"",null,null,"",null,"","",null,"",null,"","","",null,"",null,"INC","INC","INC","INC","INC","INC","INC","INC"]
[null,null,null,null,"",null,"",null,"",null,null,"",null,"","",null,"",null,"","","",null,"",null,"INC","INC","INC","INC","INC","INC","INC","INC"]
[null,null,null,null,"",null,"",null,"",null,null,"",null,"","",null,"",null,"","","",null,"",null,"INC","INC","INC","INC","INC","INC","INC","INC"]

{"sheet":"Microcircuits - PEM","index":13,"n_rows":259,"n_cols":29,"rows_kept":259,"cut":false,"hidden":false,"merged":[[9,14,9,17]]}
["PEM Microcircuit Derating Worksheet (reference GSFC Document EEE-INST-002, Section M4, Table 4)",null,null,null,null,null,null,null,null,null,null,"CUI//SP-EXPT"]
[]
[null,"Notes:",null,null,null,null,null,null,null,null,null,null,null,null,null,null,null,null,null,null,null,null,null,null,null,null,0.8,0.8,0.8]
[null,"1) In addition to the requirements below, derating specific to some PEMs may be required based on design and technology of the part intended ",null,null,null,null,null,null,null,null,null,null,null,null,null,null,null,null,null,null,null,null,null,null,null,null,0.75,1,95]
[null,"    special applications.  All part-specific derating shall be approved by the project and GSFC Code 562."]
[null,"2) For power device, do not exceed 110 °C or 40 °C below the manufacturer's rating, whichever is lower.",null,null,null,null,null,null,null,null,null,null,null,null,null,null,null,null,null,null,null,null,null,null,null,null,0.8,0.8,0.7]
[null,null,null,null,null,null,null,null,null,null,null,null,null,null,null,null,null,null,null,null,null,null,null,null,null,null,0.7,1,85]
[null,null,null,null,"     Select Part Type First",null,null,null,null,null,"      Maximum Board Temperature =",null,null,75]
[null,null,null,null,null,null,null,null,null,null,null,null,null,null,null,null,null,null,null,null,null,null,null,null,null,null,"Digital",null,"Yes"]
[null,"COMPONENT SPECIFICATION SECTION",null,null,null,null,null,null,null,null,null,null,null,null,"DERATING SECTION",null,null,null,null,null,null,null,null,null,null,null,"Lin/Mixed",null,"No"]
["Component","Ref. Des.","Part Type","Nominal Supply Voltage, Rated","Maximum Supply Voltage, Rated","Maximum Input Voltage, Rated","Maximum Specified Operating Junction Temp, Rated","Theta JC  °C/W","Power Device For Thermal Derating (See Note 2)","Maximum Output Current, Rated","Maximum Operating Frequency, Rated","GSFC Derated Supply Voltage Rqmt","Actual Supply Voltage","GSFC Derated Input Voltage Rqmt","Actual Power Dissipation","GSFC Derated Junction Temp. Reqmt","Actual Operating Junction Temp","GSFC Derated Output Current Rqmt","Actual  Output Current","GSFC Derated Clock Frequency Rqmt","Actual Clock Freq","Pass/Fail","REMARKS"]
[null,null,null,null,null,null,null,null,null,null,null,{"$f":"IF((D12<>\"\")*AND(E12<>\"\"), IF(C12=\"\", \"\", IF(C12=\"Digital\", (D12+0.5*(E12-D12)), (D12+0.8*(E12-D12)))), \"\")","v":""},null,{"$f":"IF(F12=\"\", \"\", IF(C12=\"\", \"\", IF(C12=\"Digital\", F12, 0.8*F12)))","v":""},null,{"$f":"IF(G12=\"\", \"\", IF(C12=\"\", \"\", IF(I12=\"\", \"\", IF(I12=\"No\", IF(C12=\"Digital\", MIN(95,(0.8*G12)), MIN(85, (0.7*G12))), IF(C12=\"Digital\", MIN(110, (G12-40), 0.8*G12), MIN(110, (G12-40), 0.7*G12))))))","v":""},{"$f":"IF(H12<>\"\", IF(($N$8<>\"\")*AND(I12<>\"\")*AND(O12<>\"\"), $N$8+(H12*O12), \"\"), \"\")","v":""},{"$f":"IF(J12=\"\", \"\", IF(C12=\"\", \"\", IF(C12=\"Digital\", J12*0.8, J12*0.7)))","v":""},null,{"$f":"IF(K12=\"\", \"\", IF(C12=\"\", \"\", IF(C12=\"Digital\", K12*0.8, K12*0.7)))","v":""},null,{"$f":"IF((L12<>\"\")*AND(M12<>\"\")*AND(N12<>\"\")*AND(O12<>\"\")*AND(P12<>\"\")*AND(Q12<>\"\")*AND(R12<>\"\")*AND(S12<>\"\")*AND(T12<>\"\")*AND(U12<>\"\"), IF((M12<=L12)*AND(O12<=N12)*AND(Q12<=P12)*AND(S12<=R12)*AND(U12<=T12),\"PASS\",\"FAIL\"), \"INC\")","v":"INC"}]
[null,null,null,null,null,null,null,null,null,null,null,"",null,"",null,"","","",null,"",null,"INC"]
[null,null,null,null,null,null,null,null,null,null,null,"",null,"",null,"","","",null,"",null,"INC"]
[null,null,null,null,null,null,null,null,null,null,null,"",null,"",null,"","","",null,"",null,"INC"]
[null,null,null,null,null,null,null,null,null,null,null,"",null,"",null,"","","",null,"",null,"INC"]
[null,null,null,null,null,null,null,null,null,null,null,"",null,"",null,"","","",null,"",null,"INC"]
[null,null,null,null,null,null,null,null,null,null,null,"",null,"",null,"","","",null,"",null,"INC"]
[null,null,null,null,null,null,null,null,null,null,null,"",null,"",null,"","","",null,"",null,"INC"]
[null,null,null,null,null,null,null,null,null,null,null,"",null,"",null,"","","",null,"",null,"INC"]
[null,null,null,null,null,null,null,null,null,null,null,"",null,"",null,"","","",null,"",null,"INC"]
[null,null,null,null,null,null,null,null,null,null,null,"",null,"",null,"","","",null,"",null,"INC"]
[null,null,null,null,null,null,null,null,null,null,null,"",null,"",null,"","","",null,"",null,"INC"]
[null,null,null,null,null,null,null,null,null,null,null,"",null,"",null,"","","",null,"",null,"INC"]
[null,null,null,null,null,null,null,null,null,null,null,"",null,"",null,"","","",null,"",null,"INC"]
[null,null,null,null,null,null,null,null,null,null,null,"",null,"",null,"","","",null,"",null,"INC"]
[null,null,null,null,null,null,null,null,null,null,null,"",null,"",null,"","","",null,"",null,"INC"]
[null,null,null,null,null,null,null,null,null,null,null,"",null,"",null,"","","",null,"",null,"INC"]
[null,null,null,null,null,null,null,null,null,null,null,"",null,"",null,"","","",null,"",null,"INC"]
[null,null,null,null,null,null,null,null,null,null,null,"",null,"",null,"","","",null,"",null,"INC"]
[null,null,null,null,null,null,null,null,null,null,null,"",null,"",null,"","","",null,"",null,"INC"]
[null,null,null,null,null,null,null,null,null,null,null,"",null,"",null,"","","",null,"",null,"INC"]
[null,null,null,null,null,null,null,null,null,null,null,"",null,"",null,"","","",null,"",null,"INC"]
[null,null,null,null,null,null,null,null,null,null,null,"",null,"",null,"","","",null,"",null,"INC"]
[null,null,null,null,null,null,null,null,null,null,null,"",null,"",null,"","","",null,"",null,"INC"]
[null,null,null,null,null,null,null,null,null,null,null,"",null,"",null,"","","",null,"",null,"INC"]
[null,null,null,null,null,null,null,null,null,null,null,"",null,"",null,"","","",null,"",null,"INC"]
[null,null,null,null,null,null,null,null,null,null,null,"",null,"",null,"","","",null,"",null,"INC"]
[null,null,null,null,null,null,null,null,null,null,null,"",null,"",null,"","","",null,"",null,"INC"]
[null,null,null,null,null,null,null,null,null,null,null,"",null,"",null,"","","",null,"",null,"INC"]
[null,null,null,null,null,null,null,null,null,null,null,"",null,"",null,"","","",null,"",null,"INC"]
[null,null,null,null,null,null,null,null,null,null,null,"",null,"",null,"","","",null,"",null,"INC"]
[null,null,null,null,null,null,null,null,null,null,null,"",null,"",null,"","","",null,"",null,"INC"]
[null,null,null,null,null,null,null,null,null,null,null,"",null,"",null,"","","",null,"",null,"INC"]
[null,null,null,null,null,null,null,null,null,null,null,"",null,"",null,"","","",null,"",null,"INC"]
[null,null,null,null,null,null,null,null,null,null,null,"",null,"",null,"","","",null,"",null,"INC"]
[null,null,null,null,null,null,null,null,null,null,null,"",null,"",null,"","","",null,"",null,"INC"]
[null,null,null,null,null,null,null,null,null,null,null,"",null,"",null,"","","",null,"",null,"INC"]
[null,null,null,null,null,null,null,null,null,null,null,"",null,"",null,"","","",null,"",null,"INC"]
[null,null,null,null,null,null,null,null,null,null,null,"",null,"",null,"","","",null,"",null,"INC"]
[null,null,null,null,null,null,null,null,null,null,null,"",null,"",null,"","","",null,"",null,"INC"]
[null,null,null,null,null,null,null,null,null,null,null,"",null,"",null,"","","",null,"",null,"INC"]
[null,null,null,null,null,null,null,null,null,null,null,"",null,"",null,"","","",null,"",null,"INC"]
[null,null,null,null,null,null,null,null,null,null,null,"",null,"",null,"","","",null,"",null,"INC"]
[null,null,null,null,null,null,null,null,null,null,null,"",null,"",null,"","","",null,"",null,"INC"]
[null,null,null,null,null,null,null,null,null,null,null,"",null,"",null,"","","",null,"",null,"INC"]
[null,null,null,null,null,null,null,null,null,null,null,"",null,"",null,"","","",null,"",null,"INC"]
[null,null,null,null,null,null,null,null,null,null,null,"",null,"",null,"","","",null,"",null,"INC"]
[null,null,null,null,null,null,null,null,null,null,null,"",null,"",null,"","","",null,"",null,"INC"]
[null,null,null,null,null,null,null,null,null,null,null,"",null,"",null,"","","",null,"",null,"INC"]
[null,null,null,null,null,null,null,null,null,null,null,"",null,"",null,"","","",null,"",null,"INC"]
[null,null,null,null,null,null,null,null,null,null,null,"",null,"",null,"","","",null,"",null,"INC"]
[null,null,null,null,null,null,null,null,null,null,null,"",null,"",null,"","","",null,"",null,"INC"]
[null,null,null,null,null,null,null,null,null,null,null,"",null,"",null,"","","",null,"",null,"INC"]
[null,null,null,null,null,null,null,null,null,null,null,"",null,"",null,"","","",null,"",null,"INC"]
[null,null,null,null,null,null,null,null,null,null,null,"",null,"",null,"","","",null,"",null,"INC"]
[null,null,null,null,null,null,null,null,null,null,null,"",null,"",null,"","","",null,"",null,"INC"]
[null,null,null,null,null,null,null,null,null,null,null,"",null,"",null,"","","",null,"",null,"INC"]
[null,null,null,null,null,null,null,null,null,null,null,"",null,"",null,"","","",null,"",null,"INC"]
[null,null,null,null,null,null,null,null,null,null,null,"",null,"",null,"","","",null,"",null,"INC"]
[null,null,null,null,null,null,null,null,null,null,null,"",null,"",null,"","","",null,"",null,"INC"]
[null,null,null,null,null,null,null,null,null,null,null,"",null,"",null,"","","",null,"",null,"INC"]
[null,null,null,null,null,null,null,null,null,null,null,"",null,"",null,"","","",null,"",null,"INC"]
[null,null,null,null,null,null,null,null,null,null,null,"",null,"",null,"","","",null,"",null,"INC"]
[null,null,null,null,null,null,null,null,null,null,null,"",null,"",null,"","","",null,"",null,"INC"]
[null,null,null,null,null,null,null,null,null,null,null,{"$f":"IF((D76<>\"\")*AND(E76<>\"\"), IF(C76=\"\", \"\", IF(C76=\"Digital\", (D76+0.5*(E76-D76)), (D76+0.8*(E76-D76)))), \"\")","v":""},null,{"$f":"IF(F76=\"\", \"\", IF(C76=\"\", \"\", IF(C76=\"Digital\", F76, 0.8*F76)))","v":""},null,{"$f":"IF(G76=\"\", \"\", IF(C76=\"\", \"\", IF(I76=\"\", \"\", IF(I76=\"No\", IF(C76=\"Digital\", MIN(95,(0.8*G76)), MIN(85, (0.7*G76))), IF(C76=\"Digital\", MIN(110, (G76-40), 0.8*G76), MIN(110, (G76-40), 0.7*G76))))))","v":""},{"$f":"IF(H76<>\"\", IF(($N$8<>\"\")*AND(I76<>\"\")*AND(O76<>\"\"), $N$8+(H76*O76), \"\"), \"\")","v":""},{"$f":"IF(J76=\"\", \"\", IF(C76=\"\", \"\", IF(C76=\"Digital\", J76*0.8, J76*0.7)))","v":""},null,{"$f":"IF(K76=\"\", \"\", IF(C76=\"\", \"\", IF(C76=\"Digital\", K76*0.8, K76*0.7)))","v":""},null,{"$f":"IF((L76<>\"\")*AND(M76<>\"\")*AND(N76<>\"\")*AND(O76<>\"\")*AND(P76<>\"\")*AND(Q76<>\"\")*AND(R76<>\"\")*AND(S76<>\"\")*AND(T76<>\"\")*AND(U76<>\"\"), IF((M76<=L76)*AND(O76<=N76)*AND(Q76<=P76)*AND(S76<=R76)*AND(U76<=T76),\"PASS\",\"FAIL\"), \"INC\")","v":"INC"}]
[null,null,null,null,null,null,null,null,null,null,null,"",null,"",null,"","","",null,"",null,"INC"]
[null,null,null,null,null,null,null,null,null,null,null,"",null,"",null,"","","",null,"",null,"INC"]
[null,null,null,null,null,null,null,null,null,null,null,"",null,"",null,"","","",null,"",null,"INC"]
[null,null,null,null,null,null,null,null,null,null,null,"",null,"",null,"","","",null,"",null,"INC"]
[null,null,null,null,null,null,null,null,null,null,null,"",null,"",null,"","","",null,"",null,"INC"]
[null,null,null,null,null,null,null,null,null,null,null,"",null,"",null,"","","",null,"",null,"INC"]
[null,null,null,null,null,null,null,null,null,null,null,"",null,"",null,"","","",null,"",null,"INC"]
[null,null,null,null,null,null,null,null,null,null,null,"",null,"",null,"","","",null,"",null,"INC"]
[null,null,null,null,null,null,null,null,null,null,null,"",null,"",null,"","","",null,"",null,"INC"]
[null,null,null,null,null,null,null,null,null,null,null,"",null,"",null,"","","",null,"",null,"INC"]
[null,null,null,null,null,null,null,null,null,null,null,"",null,"",null,"","","",null,"",null,"INC"]
[null,null,null,null,null,null,null,null,null,null,null,"",null,"",null,"","","",null,"",null,"INC"]
[null,null,null,null,null,null,null,null,null,null,null,"",null,"",null,"","","",null,"",null,"INC"]
[null,null,null,null,null,null,null,null,null,null,null,"",null,"",null,"","","",null,"",null,"INC"]
[null,null,null,null,null,null,null,null,null,null,null,"",null,"",null,"","","",null,"",null,"INC"]
[null,null,null,null,null,null,null,null,null,null,null,"",null,"",null,"","","",null,"",null,"INC"]
[null,null,null,null,null,null,null,null,null,null,null,"",null,"",null,"","","",null,"",null,"INC"]
[null,null,null,null,null,null,null,null,null,null,null,"",null,"",null,"","","",null,"",null,"INC"]
[null,null,null,null,null,null,null,null,null,null,null,"",null,"",null,"","","",null,"",null,"INC"]
[null,null,null,null,null,null,null,null,null,null,null,"",null,"",null,"","","",null,"",null,"INC"]
[null,null,null,null,null,null,null,null,null,null,null,"",null,"",null,"","","",null,"",null,"INC"]
[null,null,null,null,null,null,null,null,null,null,null,"",null,"",null,"","","",null,"",null,"INC"]
[null,null,null,null,null,null,null,null,null,null,null,"",null,"",null,"","","",null,"",null,"INC"]
[null,null,null,null,null,null,null,null,null,null,null,"",null,"",null,"","","",null,"",null,"INC"]
[null,null,null,null,null,null,null,null,null,null,null,"",null,"",null,"","","",null,"",null,"INC"]
[null,null,null,null,null,null,null,null,null,null,null,"",null,"",null,"","","",null,"",null,"INC"]
[null,null,null,null,null,null,null,null,null,null,null,"",null,"",null,"","","",null,"",null,"INC"]
[null,null,null,null,null,null,null,null,null,null,null,"",null,"",null,"","","",null,"",null,"INC"]
[null,null,null,null,null,null,null,null,null,null,null,"",null,"",null,"","","",null,"",null,"INC"]
[null,null,null,null,null,null,null,null,null,null,null,"",null,"",null,"","","",null,"",null,"INC"]
[null,null,null,null,null,null,null,null,null,null,null,"",null,"",null,"","","",null,"",null,"INC"]
[null,null,null,null,null,null,null,null,null,null,null,"",null,"",null,"","","",null,"",null,"INC"]
[null,null,null,null,null,null,null,null,null,null,null,"",null,"",null,"","","",null,"",null,"INC"]
[null,null,null,null,null,null,null,null,null,null,null,"",null,"",null,"","","",null,"",null,"INC"]
[null,null,null,null,null,null,null,null,null,null,null,"",null,"",null,"","","",null,"",null,"INC"]
[null,null,null,null,null,null,null,null,null,null,null,"",null,"",null,"","","",null,"",null,"INC"]
[null,null,null,null,null,null,null,null,null,null,null,"",null,"",null,"","","",null,"",null,"INC"]
[null,null,null,null,null,null,null,null,null,null,null,"",null,"",null,"","","",null,"",null,"INC"]
[null,null,null,null,null,null,null,null,null,null,null,"",null,"",null,"","","",null,"",null,"INC"]
[null,null,null,null,null,null,null,null,null,null,null,"",null,"",null,"","","",null,"",null,"INC"]
[null,null,null,null,null,null,null,null,null,null,null,"",null,"",null,"","","",null,"",null,"INC"]
[null,null,null,null,null,null,null,null,null,null,null,"",null,"",null,"","","",null,"",null,"INC"]
[null,null,null,null,null,null,null,null,null,null,null,"",null,"",null,"","","",null,"",null,"INC"]
[null,null,null,null,null,null,null,null,null,null,null,"",null,"",null,"","","",null,"",null,"INC"]
[null,null,null,null,null,null,null,null,null,null,null,"",null,"",null,"","","",null,"",null,"INC"]
[null,null,null,null,null,null,null,null,null,null,null,"",null,"",null,"","","",null,"",null,"INC"]
[null,null,null,null,null,null,null,null,null,null,null,"",null,"",null,"","","",null,"",null,"INC"]
[null,null,null,null,null,null,null,null,null,null,null,"",null,"",null,"","","",null,"",null,"INC"]
[null,null,null,null,null,null,null,null,null,null,null,"",null,"",null,"","","",null,"",null,"INC"]
[null,null,null,null,null,null,null,null,null,null,null,"",null,"",null,"","","",null,"",null,"INC"]
[null,null,null,null,null,null,null,null,null,null,null,"",null,"",null,"","","",null,"",null,"INC"]
[null,null,null,null,null,null,null,null,null,null,null,"",null,"",null,"","","",null,"",null,"INC"]
[null,null,null,null,null,null,null,null,null,null,null,"",null,"",null,"","","",null,"",null,"INC"]
[null,null,null,null,null,null,null,null,null,null,null,"",null,"",null,"","","",null,"",null,"INC"]
[null,null,null,null,null,null,null,null,null,null,null,"",null,"",null,"","","",null,"",null,"INC"]
[null,null,null,null,null,null,null,null,null,null,null,"",null,"",null,"","","",null,"",null,"INC"]
[null,null,null,null,null,null,null,null,null,null,null,"",null,"",null,"","","",null,"",null,"INC"]
[null,null,null,null,null,null,null,null,null,null,null,"",null,"",null,"","","",null,"",null,"INC"]
[null,null,null,null,null,null,null,null,null,null,null,"",null,"",null,"","","",null,"",null,"INC"]
[null,null,null,null,null,null,null,null,null,null,null,"",null,"",null,"","","",null,"",null,"INC"]
[null,null,null,null,null,null,null,null,null,null,null,"",null,"",null,"","","",null,"",null,"INC"]
[null,null,null,null,null,null,null,null,null,null,null,"",null,"",null,"","","",null,"",null,"INC"]
[null,null,null,null,null,null,null,null,null,null,null,"",null,"",null,"","","",null,"",null,"INC"]
[null,null,null,null,null,null,null,null,null,null,null,{"$f":"IF((D140<>\"\")*AND(E140<>\"\"), IF(C140=\"\", \"\", IF(C140=\"Digital\", (D140+0.5*(E140-D140)), (D140+0.8*(E140-D140)))), \"\")","v":""},null,{"$f":"IF(F140=\"\", \"\", IF(C140=\"\", \"\", IF(C140=\"Digital\", F140, 0.8*F140)))","v":""},null,{"$f":"IF(G140=\"\", \"\", IF(C140=\"\", \"\", IF(I140=\"\", \"\", IF(I140=\"No\", IF(C140=\"Digital\", MIN(95,(0.8*G140)), MIN(85, (0.7*G140))), IF(C140=\"Digital\", MIN(110, (G140-40), 0.8*G140), MIN(110, (G140-40), 0.7*G140))))))","v":""},{"$f":"IF(H140<>\"\", IF(($N$8<>\"\")*AND(I140<>\"\")*AND(O140<>\"\"), $N$8+(H140*O140), \"\"), \"\")","v":""},{"$f":"IF(J140=\"\", \"\", IF(C140=\"\", \"\", IF(C140=\"Digital\", J140*0.8, J140*0.7)))","v":""},null,{"$f":"IF(K140=\"\", \"\", IF(C140=\"\", \"\", IF(C140=\"Digital\", K140*0.8, K140*0.7)))","v":""},null,{"$f":"IF((L140<>\"\")*AND(M140<>\"\")*AND(N140<>\"\")*AND(O140<>\"\")*AND(P140<>\"\")*AND(Q140<>\"\")*AND(R140<>\"\")*AND(S140<>\"\")*AND(T140<>\"\")*AND(U140<>\"\"), IF((M140<=L140)*AND(O140<=N140)*AND(Q140<=P140)*AND(S140<=R140)*AND(U140<=T140),\"PASS\",\"FAIL\"), \"INC\")","v":"INC"}]
[null,null,null,null,null,null,null,null,null,null,null,"",null,"",null,"","","",null,"",null,"INC"]
[null,null,null,null,null,null,null,null,null,null,null,"",null,"",null,"","","",null,"",null,"INC"]
[null,null,null,null,null,null,null,null,null,null,null,"",null,"",null,"","","",null,"",null,"INC"]
[null,null,null,null,null,null,null,null,null,null,null,"",null,"",null,"","","",null,"",null,"INC"]
[null,null,null,null,null,null,null,null,null,null,null,"",null,"",null,"","","",null,"",null,"INC"]
[null,null,null,null,null,null,null,null,null,null,null,"",null,"",null,"","","",null,"",null,"INC"]
[null,null,null,null,null,null,null,null,null,null,null,"",null,"",null,"","","",null,"",null,"INC"]
[null,null,null,null,null,null,null,null,null,null,null,"",null,"",null,"","","",null,"",null,"INC"]
[null,null,null,null,null,null,null,null,null,null,null,"",null,"",null,"","","",null,"",null,"INC"]
[null,null,null,null,null,null,null,null,null,null,null,"",null,"",null,"","","",null,"",null,"INC"]
[null,null,null,null,null,null,null,null,null,null,null,"",null,"",null,"","","",null,"",null,"INC"]
[null,null,null,null,null,null,null,null,null,null,null,"",null,"",null,"","","",null,"",null,"INC"]
[null,null,null,null,null,null,null,null,null,null,null,"",null,"",null,"","","",null,"",null,"INC"]
[null,null,null,null,null,null,null,null,null,null,null,"",null,"",null,"","","",null,"",null,"INC"]
[null,null,null,null,null,null,null,null,null,null,null,"",null,"",null,"","","",null,"",null,"INC"]
[null,null,null,null,null,null,null,null,null,null,null,"",null,"",null,"","","",null,"",null,"INC"]
[null,null,null,null,null,null,null,null,null,null,null,"",null,"",null,"","","",null,"",null,"INC"]
[null,null,null,null,null,null,null,null,null,null,null,"",null,"",null,"","","",null,"",null,"INC"]
[null,null,null,null,null,null,null,null,null,null,null,"",null,"",null,"","","",null,"",null,"INC"]
[null,null,null,null,null,null,null,null,null,null,null,"",null,"",null,"","","",null,"",null,"INC"]
[null,null,null,null,null,null,null,null,null,null,null,"",null,"",null,"","","",null,"",null,"INC"]
[null,null,null,null,null,null,null,null,null,null,null,"",null,"",null,"","","",null,"",null,"INC"]
[null,null,null,null,null,null,null,null,null,null,null,"",null,"",null,"","","",null,"",null,"INC"]
[null,null,null,null,null,null,null,null,null,null,null,"",null,"",null,"","","",null,"",null,"INC"]
[null,null,null,null,null,null,null,null,null,null,null,"",null,"",null,"","","",null,"",null,"INC"]
[null,null,null,null,null,null,null,null,null,null,null,"",null,"",null,"","","",null,"",null,"INC"]
[null,null,null,null,null,null,null,null,null,null,null,"",null,"",null,"","","",null,"",null,"INC"]
[null,null,null,null,null,null,null,null,null,null,null,"",null,"",null,"","","",null,"",null,"INC"]
[null,null,null,null,null,null,null,null,null,null,null,"",null,"",null,"","","",null,"",null,"INC"]
[null,null,null,null,null,null,null,null,null,null,null,"",null,"",null,"","","",null,"",null,"INC"]
[null,null,null,null,null,null,null,null,null,null,null,"",null,"",null,"","","",null,"",null,"INC"]
[null,null,null,null,null,null,null,null,null,null,null,"",null,"",null,"","","",null,"",null,"INC"]
[null,null,null,null,null,null,null,null,null,null,null,"",null,"",null,"","","",null,"",null,"INC"]
[null,null,null,null,null,null,null,null,null,null,null,"",null,"",null,"","","",null,"",null,"INC"]
[null,null,null,null,null,null,null,null,null,null,null,"",null,"",null,"","","",null,"",null,"INC"]
[null,null,null,null,null,null,null,null,null,null,null,"",null,"",null,"","","",null,"",null,"INC"]
[null,null,null,null,null,null,null,null,null,null,null,"",null,"",null,"","","",null,"",null,"INC"]
[null,null,null,null,null,null,null,null,null,null,null,"",null,"",null,"","","",null,"",null,"INC"]
[null,null,null,null,null,null,null,null,null,null,null,"",null,"",null,"","","",null,"",null,"INC"]
[null,null,null,null,null,null,null,null,null,null,null,"",null,"",null,"","","",null,"",null,"INC"]
[null,null,null,null,null,null,null,null,null,null,null,"",null,"",null,"","","",null,"",null,"INC"]
[null,null,null,null,null,null,null,null,null,null,null,"",null,"",null,"","","",null,"",null,"INC"]
[null,null,null,null,null,null,null,null,null,null,null,"",null,"",null,"","","",null,"",null,"INC"]
[null,null,null,null,null,null,null,null,null,null,null,"",null,"",null,"","","",null,"",null,"INC"]
[null,null,null,null,null,null,null,null,null,null,null,"",null,"",null,"","","",null,"",null,"INC"]
[null,null,null,null,null,null,null,null,null,null,null,"",null,"",null,"","","",null,"",null,"INC"]
[null,null,null,null,null,null,null,null,null,null,null,"",null,"",null,"","","",null,"",null,"INC"]
[null,null,null,null,null,null,null,null,null,null,null,"",null,"",null,"","","",null,"",null,"INC"]
[null,null,null,null,null,null,null,null,null,null,null,"",null,"",null,"","","",null,"",null,"INC"]
[null,null,null,null,null,null,null,null,null,null,null,"",null,"",null,"","","",null,"",null,"INC"]
[null,null,null,null,null,null,null,null,null,null,null,"",null,"",null,"","","",null,"",null,"INC"]
[null,null,null,null,null,null,null,null,null,null,null,"",null,"",null,"","","",null,"",null,"INC"]
[null,null,null,null,null,null,null,null,null,null,null,"",null,"",null,"","","",null,"",null,"INC"]
[null,null,null,null,null,null,null,null,null,null,null,"",null,"",null,"","","",null,"",null,"INC"]
[null,null,null,null,null,null,null,null,null,null,null,"",null,"",null,"","","",null,"",null,"INC"]
[null,null,null,null,null,null,null,null,null,null,null,"",null,"",null,"","","",null,"",null,"INC"]
[null,null,null,null,null,null,null,null,null,null,null,"",null,"",null,"","","",null,"",null,"INC"]
[null,null,null,null,null,null,null,null,null,null,null,"",null,"",null,"","","",null,"",null,"INC"]
[null,null,null,null,null,null,null,null,null,null,null,"",null,"",null,"","","",null,"",null,"INC"]
[null,null,null,null,null,null,null,null,null,null,null,"",null,"",null,"","","",null,"",null,"INC"]
[null,null,null,null,null,null,null,null,null,null,null,"",null,"",null,"","","",null,"",null,"INC"]
[null,null,null,null,null,null,null,null,null,null,null,"",null,"",null,"","","",null,"",null,"INC"]
[null,null,null,null,null,null,null,null,null,null,null,"",null,"",null,"","","",null,"",null,"INC"]
[null,null,null,null,null,null,null,null,null,null,null,{"$f":"IF((D204<>\"\")*AND(E204<>\"\"), IF(C204=\"\", \"\", IF(C204=\"Digital\", (D204+0.5*(E204-D204)), (D204+0.8*(E204-D204)))), \"\")","v":""},null,{"$f":"IF(F204=\"\", \"\", IF(C204=\"\", \"\", IF(C204=\"Digital\", F204, 0.8*F204)))","v":""},null,{"$f":"IF(G204=\"\", \"\", IF(C204=\"\", \"\", IF(I204=\"\", \"\", IF(I204=\"No\", IF(C204=\"Digital\", MIN(95,(0.8*G204)), MIN(85, (0.7*G204))), IF(C204=\"Digital\", MIN(110, (G204-40), 0.8*G204), MIN(110, (G204-40), 0.7*G204))))))","v":""},{"$f":"IF(H204<>\"\", IF(($N$8<>\"\")*AND(I204<>\"\")*AND(O204<>\"\"), $N$8+(H204*O204), \"\"), \"\")","v":""},{"$f":"IF(J204=\"\", \"\", IF(C204=\"\", \"\", IF(C204=\"Digital\", J204*0.8, J204*0.7)))","v":""},null,{"$f":"IF(K204=\"\", \"\", IF(C204=\"\", \"\", IF(C204=\"Digital\", K204*0.8, K204*0.7)))","v":""},null,{"$f":"IF((L204<>\"\")*AND(M204<>\"\")*AND(N204<>\"\")*AND(O204<>\"\")*AND(P204<>\"\")*AND(Q204<>\"\")*AND(R204<>\"\")*AND(S204<>\"\")*AND(T204<>\"\")*AND(U204<>\"\"), IF((M204<=L204)*AND(O204<=N204)*AND(Q204<=P204)*AND(S204<=R204)*AND(U204<=T204),\"PASS\",\"FAIL\"), \"INC\")","v":"INC"}]
[null,null,null,null,null,null,null,null,null,null,null,"",null,"",null,"","","",null,"",null,"INC"]
[null,null,null,null,null,null,null,null,null,null,null,"",null,"",null,"","","",null,"",null,"INC"]
[null,null,null,null,null,null,null,null,null,null,null,"",null,"",null,"","","",null,"",null,"INC"]
[null,null,null,null,null,null,null,null,null,null,null,"",null,"",null,"","","",null,"",null,"INC"]
[null,null,null,null,null,null,null,null,null,null,null,"",null,"",null,"","","",null,"",null,"INC"]
[null,null,null,null,null,null,null,null,null,null,null,"",null,"",null,"","","",null,"",null,"INC"]
[null,null,null,null,null,null,null,null,null,null,null,"",null,"",null,"","","",null,"",null,"INC"]
[null,null,null,null,null,null,null,null,null,null,null,"",null,"",null,"","","",null,"",null,"INC"]
[null,null,null,null,null,null,null,null,null,null,null,"",null,"",null,"","","",null,"",null,"INC"]
[null,null,null,null,null,null,null,null,null,null,null,"",null,"",null,"","","",null,"",null,"INC"]
[null,null,null,null,null,null,null,null,null,null,null,"",null,"",null,"","","",null,"",null,"INC"]
[null,null,null,null,null,null,null,null,null,null,null,"",null,"",null,"","","",null,"",null,"INC"]
[null,null,null,null,null,null,null,null,null,null,null,"",null,"",null,"","","",null,"",null,"INC"]
[null,null,null,null,null,null,null,null,null,null,null,"",null,"",null,"","","",null,"",null,"INC"]
[null,null,null,null,null,null,null,null,null,null,null,"",null,"",null,"","","",null,"",null,"INC"]
[null,null,null,null,null,null,null,null,null,null,null,"",null,"",null,"","","",null,"",null,"INC"]
[null,null,null,null,null,null,null,null,null,null,null,"",null,"",null,"","","",null,"",null,"INC"]
[null,null,null,null,null,null,null,null,null,null,null,"",null,"",null,"","","",null,"",null,"INC"]
[null,null,null,null,null,null,null,null,null,null,null,"",null,"",null,"","","",null,"",null,"INC"]
[null,null,null,null,null,null,null,null,null,null,null,"",null,"",null,"","","",null,"",null,"INC"]
[null,null,null,null,null,null,null,null,null,null,null,"",null,"",null,"","","",null,"",null,"INC"]
[null,null,null,null,null,null,null,null,null,null,null,"",null,"",null,"","","",null,"",null,"INC"]
[null,null,null,null,null,null,null,null,null,null,null,"",null,"",null,"","","",null,"",null,"INC"]
[null,null,null,null,null,null,null,null,null,null,null,"",null,"",null,"","","",null,"",null,"INC"]
[null,null,null,null,null,null,null,null,null,null,null,"",null,"",null,"","","",null,"",null,"INC"]
[null,null,null,null,null,null,null,null,null,null,null,"",null,"",null,"","","",null,"",null,"INC"]
[null,null,null,null,null,null,null,null,null,null,null,"",null,"",null,"","","",null,"",null,"INC"]
[null,null,null,null,null,null,null,null,null,null,null,"",null,"",null,"","","",null,"",null,"INC"]
[null,null,null,null,null,null,null,null,null,null,null,"",null,"",null,"","","",null,"",null,"INC"]
[null,null,null,null,null,null,null,null,null,null,null,"",null,"",null,"","","",null,"",null,"INC"]
[null,null,null,null,null,null,null,null,null,null,null,"",null,"",null,"","","",null,"",null,"INC"]
[null,null,null,null,null,null,null,null,null,null,null,"",null,"",null,"","","",null,"",null,"INC"]
[null,null,null,null,null,null,null,null,null,null,null,"",null,"",null,"","","",null,"",null,"INC"]
[null,null,null,null,null,null,null,null,null,null,null,"",null,"",null,"","","",null,"",null,"INC"]
[null,null,null,null,null,null,null,null,null,null,null,"",null,"",null,"","","",null,"",null,"INC"]
[null,null,null,null,null,null,null,null,null,null,null,"",null,"",null,"","","",null,"",null,"INC"]
[null,null,null,null,null,null,null,null,null,null,null,"",null,"",null,"","","",null,"",null,"INC"]
[null,null,null,null,null,null,null,null,null,null,null,"",null,"",null,"","","",null,"",null,"INC"]
[null,null,null,null,null,null,null,null,null,null,null,"",null,"",null,"","","",null,"",null,"INC"]
[null,null,null,null,null,null,null,null,null,null,null,"",null,"",null,"","","",null,"",null,"INC"]
[null,null,null,null,null,null,null,null,null,null,null,"",null,"",null,"","","",null,"",null,"INC"]
[null,null,null,null,null,null,null,null,null,null,null,"",null,"",null,"","","",null,"",null,"INC"]
[null,null,null,null,null,null,null,null,null,null,null,"",null,"",null,"","","",null,"",null,"INC"]
[null,null,null,null,null,null,null,null,null,null,null,"",null,"",null,"","","",null,"",null,"INC"]
[null,null,null,null,null,null,null,null,null,null,null,"",null,"",null,"","","",null,"",null,"INC"]
[null,null,null,null,null,null,null,null,null,null,null,"",null,"",null,"","","",null,"",null,"INC"]
[null,null,null,null,null,null,null,null,null,null,null,"",null,"",null,"","","",null,"",null,"INC"]
[null,null,null,null,null,null,null,null,null,null,null,"",null,"",null,"","","",null,"",null,"INC"]
[null,null,null,null,null,null,null,null,null,null,null,"",null,"",null,"","","",null,"",null,"INC"]
[null,null,null,null,null,null,null,null,null,null,null,"",null,"",null,"","","",null,"",null,"INC"]
[null,null,null,null,null,null,null,null,null,null,null,"",null,"",null,"","","",null,"",null,"INC"]
[null,null,null,null,null,null,null,null,null,null,null,"",null,"",null,"","","",null,"",null,"INC"]
[null,null,null,null,null,null,null,null,null,null,null,"",null,"",null,"","","",null,"",null,"INC"]
[null,null,null,null,null,null,null,null,null,null,null,"",null,"",null,"","","",null,"",null,"INC"]
[null,null,null,null,null,null,null,null,null,null,null,"",null,"",null,"","","",null,"",null,"INC"]

{"sheet":"Connectors","index":14,"n_rows":105,"n_cols":19,"rows_kept":105,"cut":false,"hidden":false,"merged":[[2,1,2,13]]}
["Connector Derating Workbook (reference GSFC Document EEE-INST-002, Section C2, Table 5)",null,null,null,null,null,null,null,null,"CUI//SP-EXPT"]
[]
["Notes:","   1. Operating Voltage is derated to either 25% of the connector Dielectric Withstanding test Voltage (at sea level, unconditioned), or \n       75% of connector rated operating (working) voltage (at sea level), whichever is lower. "]
[null,"   2. For printed circuit connectors, apply derating based on the contact size vs. the equivalent wire size in section W1, table 4A, for bundled cable."]
[]
[]
[]
[]
["Components","Ref. Des.","Rated Operating Voltage (V)","Dielectric Withstanding test Voltage","Contact Pin Diameter Equivalent Wire Size","Rated Temperature (°C)","Derated Operating Voltage (ROV)","Derated Operating Voltage (DWV)","Minimum of Derated Operating Voltage","Actual Operating\nVoltage (max)","Derated Allowable Contact Current","Actual Contact\nCurrent","Actual \nTemperature","PASS/FAIL","REMARKS"]
[null,null,null,null,null,null,{"$f":"IF(C10<>\"\", 0.75*C10,\"\")","v":""},{"$f":"IF(D10<>\"\", 0.25*D10,\"\")","v":""},{"$f":"IF(OR($G10<>\"\",$H10<>\"\"),MIN(G10:H10),\"\")","v":""},null,{"$f":"IF(E10<>\"\",VLOOKUP(E10,$R$10:$S$25,2),\"\")","v":""},null,null,{"$f":"IF(OR(C10<>\"\",D10<>\"\")*AND(E10<>\"\")*AND(F10<>\"\")*AND(J10<>\"\")*AND(L10<>\"\")*AND(M10<>\"\"), IF((J10<=I10)*AND((F10-25)>=M10)*AND(L10<=K10),\"PASS\",\"FAIL\"), \"INC\")","v":"INC"},null,null,null,0,75]
[null,null,null,null,null,null,{"$f":"IF(C11<>\"\", 0.75*C11,\"\")","v":""},{"$f":"IF(D11<>\"\", 0.25*D11,\"\")","v":""},{"$f":"IF(OR($G11<>\"\",$H11<>\"\"),MIN(G11:H11),\"\")","v":""},null,"",null,null,{"$f":"IF(OR(C11<>\"\",D11<>\"\")*AND(E11<>\"\")*AND(F11<>\"\")*AND(J11<>\"\")*AND(L11<>\"\")*AND(M11<>\"\"), IF((J11<=I11)*AND((F11-25)>=M11)*AND(L11<=K11),\"PASS\",\"FAIL\"), \"INC\")","v":"INC"},null,null,null,2,50]
[null,null,null,null,null,null,"","",{"$f":"IF(OR($G12<>\"\",$H12<>\"\"),MIN(G12:H12),\"\")","v":""},null,"",null,null,"INC",null,null,null,4,40]
[null,null,null,null,null,null,"","",{"$f":"IF(OR($G13<>\"\",$H13<>\"\"),MIN(G13:H13),\"\")","v":""},null,"",null,null,"INC",null,null,null,6,30]
[null,null,null,null,null,null,"","",{"$f":"IF(OR($G14<>\"\",$H14<>\"\"),MIN(G14:H14),\"\")","v":""},null,"",null,null,"INC",null,null,null,8,23]
[null,null,null,null,null,null,"","",{"$f":"IF(OR($G15<>\"\",$H15<>\"\"),MIN(G15:H15),\"\")","v":""},null,"",null,null,"INC",null,null,null,10,16.5]
[null,null,null,null,null,null,"","","",null,"",null,null,"INC",null,null,null,12,11.5]
[null,null,null,null,null,null,"","","",null,"",null,null,"INC",null,null,null,14,8.5]
[null,null,null,null,null,null,"","","",null,"",null,null,"INC",null,null,null,16,6.5]
[null,null,null,null,null,null,"","","",null,"",null,null,"INC",null,null,null,18,5]
[null,null,null,null,null,null,"","","",null,"",null,null,"INC",null,null,null,20,3.7]
[null,null,null,null,null,null,"","","",null,"",null,null,"INC",null,null,null,22,2.5]
[null,null,null,null,null,null,"","","",null,"",null,null,"INC",null,null,null,24,2]
[null,null,null,null,null,null,"","","",null,"",null,null,"INC",null,null,null,26,1.4]
[null,null,null,null,null,null,"","","",null,"",null,null,"INC",null,null,null,28,1]
[null,null,null,null,null,null,"","","",null,"",null,null,"INC",null,null,null,30,0.7]
[null,null,null,null,null,null,"","","",null,"",null,null,"INC"]
[null,null,null,null,null,null,"","","",null,"",null,null,"INC"]
[null,null,null,null,null,null,"","","",null,"",null,null,"INC"]
[null,null,null,null,null,null,"","","",null,"",null,null,"INC"]
[null,null,null,null,null,null,"","","",null,"",null,null,"INC"]
[null,null,null,null,null,null,"","","",null,"",null,null,"INC"]
[null,null,null,null,null,null,"","","",null,"",null,null,"INC"]
[null,null,null,null,null,null,"","","",null,"",null,null,"INC"]
[null,null,null,null,null,null,"","","",null,"",null,null,"INC"]
[null,null,null,null,null,null,"","","",null,"",null,null,"INC"]
[null,null,null,null,null,null,"","","",null,"",null,null,"INC"]
[null,null,null,null,null,null,"","","",null,"",null,null,"INC"]
[null,null,null,null,null,null,"","","",null,"",null,null,"INC"]
[null,null,null,null,null,null,"","","",null,"",null,null,"INC"]
[null,null,null,null,null,null,"","","",null,"",null,null,"INC"]
[null,null,null,null,null,null,"","","",null,"",null,null,"INC"]
[null,null,null,null,null,null,"","","",null,"",null,null,"INC"]
[null,null,null,null,null,null,"","","",null,"",null,null,"INC"]
[null,null,null,null,null,null,"","","",null,"",null,null,"INC"]
[null,null,null,null,null,null,"","","",null,"",null,null,"INC"]
[null,null,null,null,null,null,"","","",null,"",null,null,"INC"]
[null,null,null,null,null,null,"","","",null,"",null,null,"INC"]
[null,null,null,null,null,null,"","","",null,"",null,null,"INC"]
[null,null,null,null,null,null,"","","",null,"",null,null,"INC"]
[null,null,null,null,null,null,"","","",null,"",null,null,"INC"]
[null,null,null,null,null,null,"","","",null,"",null,null,"INC"]
[null,null,null,null,null,null,"","","",null,"",null,null,"INC"]
[null,null,null,null,null,null,"","","",null,"",null,null,"INC"]
[null,null,null,null,null,null,"","","",null,"",null,null,"INC"]
[null,null,null,null,null,null,"","","",null,"",null,null,"INC"]
[null,null,null,null,null,null,"","","",null,"",null,null,"INC"]
[null,null,null,null,null,null,"","","",null,"",null,null,"INC"]
[null,null,null,null,null,null,"","","",null,"",null,null,"INC"]
[null,null,null,null,null,null,"","","",null,"",null,null,"INC"]
[null,null,null,null,null,null,"","","",null,"",null,null,"INC"]
[null,null,null,null,null,null,"","","",null,"",null,null,"INC"]
[null,null,null,null,null,null,"","","",null,"",null,null,"INC"]
[null,null,null,null,null,null,"","","",null,"",null,null,"INC"]
[null,null,null,null,null,null,"","","",null,"",null,null,"INC"]
[null,null,null,null,null,null,"","","",null,"",null,null,"INC"]
[null,null,null,null,null,null,"","","",null,"",null,null,"INC"]
[null,null,null,null,null,null,"","","",null,"",null,null,"INC"]
[null,null,null,null,null,null,"","","",null,"",null,null,"INC"]
[null,null,null,null,null,null,"","","",null,"",null,null,"INC"]
[null,null,null,null,null,null,"","","",null,"",null,null,"INC"]
[null,null,null,null,null,null,"","","",null,"",null,null,"INC"]
[null,null,null,null,null,null,"","","",null,"",null,null,"INC"]
[null,null,null,null,null,null,"","","",null,"",null,null,"INC"]
[null,null,null,null,null,null,"","","",null,{"$f":"IF(E74<>\"\",VLOOKUP(E74,$R$10:$S$25,2),\"\")","v":""},null,null,"INC"]
[null,null,null,null,null,null,{"$f":"IF(C75<>\"\", 0.75*C75,\"\")","v":""},{"$f":"IF(D75<>\"\", 0.25*D75,\"\")","v":""},"",null,"",null,null,{"$f":"IF(OR(C75<>\"\",D75<>\"\")*AND(E75<>\"\")*AND(F75<>\"\")*AND(J75<>\"\")*AND(L75<>\"\")*AND(M75<>\"\"), IF((J75<=I75)*AND((F75-25)>=M75)*AND(L75<=K75),\"PASS\",\"FAIL\"), \"INC\")","v":"INC"}]
[null,null,null,null,null,null,"","","",null,"",null,null,"INC"]
[null,null,null,null,null,null,"","","",null,"",null,null,"INC"]
[null,null,null,null,null,null,"","","",null,"",null,null,"INC"]
[null,null,null,null,null,null,"","",{"$f":"IF(OR($G79<>\"\",$H79<>\"\"),MIN(G79:H79),\"\")","v":""},null,"",null,null,"INC"]
[null,null,null,null,null,null,"","","",null,"",null,null,"INC"]
[null,null,null,null,null,null,"","","",null,"",null,null,"INC"]
[null,null,null,null,null,null,"","","",null,"",null,null,"INC"]
[null,null,null,null,null,null,"","","",null,"",null,null,"INC"]
[null,null,null,null,null,null,"","","",null,"",null,null,"INC"]
[null,null,null,null,null,null,"","","",null,"",null,null,"INC"]
[null,null,null,null,null,null,"","","",null,"",null,null,"INC"]
[null,null,null,null,null,null,"","","",null,"",null,null,"INC"]
[null,null,null,null,null,null,"","","",null,"",null,null,"INC"]
[null,null,null,null,null,null,"","","",null,"",null,null,"INC"]
[null,null,null,null,null,null,"","","",null,"",null,null,"INC"]
[null,null,null,null,null,null,"","","",null,"",null,null,"INC"]
[null,null,null,null,null,null,"","","",null,"",null,null,"INC"]
[null,null,null,null,null,null,"","","",null,"",null,null,"INC"]
[null,null,null,null,null,null,"","","",null,"",null,null,"INC"]
[null,null,null,null,null,null,"","","",null,"",null,null,"INC"]
[null,null,null,null,null,null,"","","",null,"",null,null,"INC"]
[null,null,null,null,null,null,"","","",null,"",null,null,"INC"]
[null,null,null,null,null,null,"","","",null,"",null,null,"INC"]
[null,null,null,null,null,null,"","","",null,"",null,null,"INC"]
[null,null,null,null,null,null,"","","",null,"",null,null,"INC"]
[null,null,null,null,null,null,"","","",null,"",null,null,"INC"]
[null,null,null,null,null,null,"","","",null,"",null,null,"INC"]
[null,null,null,null,null,null,"","","",null,"",null,null,"INC"]
[null,null,null,null,null,null,"","","",null,"",null,null,"INC"]
[null,null,null,null,null,null,{"$f":"IF(C105<>\"\", 0.75*C105,\"\")","v":""},{"$f":"IF(D105<>\"\", 0.25*D105,\"\")","v":""},{"$f":"IF(OR($G105<>\"\",$H105<>\"\"),MIN(G105:H105),\"\")","v":""},null,"",null,null,"INC"]

{"sheet":"Magnetics","index":15,"n_rows":100,"n_cols":18,"rows_kept":100,"cut":false,"hidden":false,"merged":[[15,8,15,9]]}
["Magnetics Derating Worksheet (reference GSFC Document EEE-INST-002, Section M1, Table 4)",null,null,null,null,null,null,null,null,"CUI//SP-EXPT"]
[]
["Notes:",null,null,null,null,null,null,null,null,null,null,null,null,null,null,"Q",85,65]
["1)     a) The maximum operating temperature equals ambient temperature plus temperature rise plus 10°C allowance for hot spots. The temperature rise may be calculated in accordance",null,null,null,null,null,null,null,null,null,null,null,null,null,null,"O",85,65]
["            with Mil-PRF-27, paragraph 4.7.13.  The formula is:  ",null,null,null,null,"      ΔT = ((R - r)/r) * (t + 234.5) - (T - t)",null,null,"Where:",null,null,null,null,null,null,"R",105,85]
["            ΔT = Temperature rise (in °C) above specified maximum ambient temperature.",null,null,null,null,null,null,"T = maximum ambient temperature (in °C) at time of power shutoff. (T) shall not differ by more than 5°C.",null,null,null,null,null,null,null,"A",105,85]
["            R = Resistance of winding (in ohms) at temperature (T + ΔT)",null,null,null,null,null,"r = Resistance of winding (in ohms) at temperature (t)",null,null,null,"t = Specified initial ambient temperature in °C",null,null,null,null,"S",130,110]
["        b) The insulation classes of MIL-style inductive parts generally have maximum operating temperature ratings based on life expectancy of 10,000 hours.",null,null,null,null,null,null,null,null,null,null,null,null,null,null,"B",125,105]
["            The derated operating temperatures are selected to extend the life expectancy to 50,000 hours at rated voltage.",null,null,null,null,null,null,null,null,null,null,null,null,null,null,"C",">125 (enter directly here)","=Tmax - 20"]
["        c) Custom made inductive devices shall be evaluated on a materials basis to determine the maximum operating temperature. Devices with temperature ratings different from the military",null,null,null,null,null,null,null,null,null,null,null,null,null,null,"F",150,130]
["            insulations classes shall be derated to 0.75 times maximum operating temperature.",null,null,null,null,null,null,null,null,null,null,null,null,null,null,"Other","enter directly","0.75*Max Op Temp"]
["2) MIL-PRF-21038 has a maximum operating temperature range of 130°C. For MIL-PRF-83446, refer to the detailed specification sheet for the maximum operating temperature."]
[]
[]
["MAGNETICS"]
[null,null,"COMPONENT SPECIFICATION SECTION",null,null,null,null,null,"DERATING SECTION"]
["Component","Ref. Des.","Insulation Class","Maximum Operating Temperature, Rated","Maximum Operating Voltage, Rated","GSFC Derated Operating Temperature Requirement","Actual Operating Temperature","GSFC Derated Voltage Requirement","Actual Voltage","Pass/Fail","REMARKS"]
[null,null,null,{"$f":"IF(C18<>\"\",VLOOKUP(C18,$P$3:$Q$11,2,FALSE),\"\")","v":""},null,{"$f":"IF(C18<>\"\",IF(C18=\"Other\",0.75*D18,IF(C18=\"C\",D18-20,VLOOKUP(C18,$P$3:$R$11,3,FALSE))), \"\")","v":""},null,{"$f":"IF(E18<>\"\", E18*0.5, \"\")","v":""},null,{"$f":"IF((F18<>\"\")*AND(H18<>\"\")*AND(G18<>\"\")*AND(I18<>\"\"), IF((G18<=F18)*AND(I18<=H18),\"PASS\",\"FAIL\"), \"INC\")","v":"INC"}]
[null,null,null,"",null,"",null,"",null,{"$f":"IF((F19<>\"\")*AND(H19<>\"\")*AND(G19<>\"\")*AND(I19<>\"\"), IF((G19<=F19)*AND(I19<=H19),\"PASS\",\"FAIL\"), \"INC\")","v":"INC"}]
[null,null,null,"",null,"",null,"",null,"INC"]
[null,null,null,"",null,"",null,"",null,"INC"]
[null,null,null,"",null,"",null,"",null,"INC"]
[null,null,null,"",null,"",null,"",null,"INC"]
[null,null,null,"",null,"",null,"",null,"INC"]
[null,null,null,"",null,"",null,"",null,"INC"]
[null,null,null,"",null,"",null,"",null,"INC"]
[null,null,null,"",null,"",null,"",null,"INC"]
[null,null,null,"",null,"",null,"",null,"INC"]
[null,null,null,"",null,"",null,"",null,"INC"]
[null,null,null,"",null,"",null,"",null,"INC"]
[null,null,null,"",null,"",null,"",null,"INC"]
[null,null,null,"",null,"",null,"",null,"INC"]
[null,null,null,"",null,"",null,"",null,"INC"]
[null,null,null,"",null,"",null,"",null,"INC"]
[null,null,null,"",null,"",null,"",null,"INC"]
[null,null,null,"",null,"",null,"",null,"INC"]
[null,null,null,"",null,"",null,"",null,"INC"]
[null,null,null,"",null,"",null,"",null,"INC"]
[null,null,null,"",null,"",null,"",null,"INC"]
[null,null,null,"",null,"",null,"",null,"INC"]
[null,null,null,"",null,"",null,"",null,"INC"]
[null,null,null,"",null,"",null,"",null,"INC"]
[null,null,null,"",null,"",null,"",null,"INC"]
[null,null,null,"",null,"",null,"",null,"INC"]
[null,null,null,"",null,"",null,"",null,"INC"]
[null,null,null,"",null,"",null,"",null,"INC"]
[null,null,null,"",null,"",null,"",null,"INC"]
[null,null,null,"",null,"",null,"",null,"INC"]
[null,null,null,"",null,"",null,"",null,"INC"]
[null,null,null,"",null,"",null,"",null,"INC"]
[null,null,null,"",null,"",null,"",null,"INC"]
[null,null,null,"",null,"",null,"",null,"INC"]
[null,null,null,"",null,"",null,"",null,"INC"]
[null,null,null,"",null,"",null,"",null,"INC"]
[null,null,null,"",null,"",null,"",null,"INC"]
[null,null,null,"",null,"",null,"",null,"INC"]
[null,null,null,"",null,"",null,"",null,"INC"]
[null,null,null,"",null,"",null,"",null,"INC"]
[null,null,null,"",null,"",null,"",null,"INC"]
[null,null,null,"",null,"",null,"",null,"INC"]
[null,null,null,"",null,"",null,"",null,"INC"]
[null,null,null,"",null,"",null,"",null,"INC"]
[null,null,null,"",null,"",null,"",null,"INC"]
[null,null,null,"",null,"",null,"",null,"INC"]
[null,null,null,"",null,"",null,"",null,"INC"]
[null,null,null,"",null,"",null,"",null,"INC"]
[null,null,null,"",null,"",null,"",null,"INC"]
[null,null,null,"",null,"",null,"",null,"INC"]
[null,null,null,"",null,"",null,"",null,"INC"]
[null,null,null,"",null,"",null,"",null,"INC"]
[null,null,null,"",null,"",null,"",null,"INC"]
[null,null,null,"",null,"",null,"",null,"INC"]
[null,null,null,"",null,"",null,"",null,"INC"]
[null,null,null,"",null,"",null,"",null,"INC"]
[null,null,null,"",null,"",null,"",null,"INC"]
[null,null,null,"",null,"",null,"",null,"INC"]
[null,null,null,"",null,"",null,"",null,"INC"]
[null,null,null,"",null,"",null,"",null,"INC"]
[null,null,null,"",null,"",null,"",null,"INC"]
[null,null,null,"",null,"",null,"",null,"INC"]
[null,null,null,"",null,"",null,"",null,"INC"]
[null,null,null,"",null,{"$f":"IF(C82<>\"\",IF(C82=\"Other\",0.75*D82,IF(C82=\"C\",D82-20,VLOOKUP(C82,$P$3:$R$11,3,FALSE))), \"\")","v":""},null,"",null,"INC"]
[null,null,null,{"$f":"IF(C83<>\"\",VLOOKUP(C83,$P$3:$Q$11,2,FALSE),\"\")","v":""},null,"",null,{"$f":"IF(E83<>\"\", E83*0.5, \"\")","v":""},null,{"$f":"IF((F83<>\"\")*AND(H83<>\"\")*AND(G83<>\"\")*AND(I83<>\"\"), IF((G83<=F83)*AND(I83<=H83),\"PASS\",\"FAIL\"), \"INC\")","v":"INC"}]
[null,null,null,"",null,"",null,"",null,"INC"]
[null,null,null,"",null,"",null,"",null,"INC"]
[null,null,null,"",null,"",null,"",null,"INC"]
[null,null,null,"",null,"",null,"",null,"INC"]
[null,null,null,"",null,"",null,"",null,"INC"]
[null,null,null,"",null,"",null,"",null,"INC"]
[null,null,null,"",null,"",null,"",null,"INC"]
[null,null,null,"",null,"",null,"",null,"INC"]
[null,null,null,"",null,"",null,"",null,"INC"]
[null,null,null,"",null,"",null,"",null,"INC"]
[null,null,null,"",null,"",null,"",null,"INC"]
[null,null,null,"",null,"",null,"",null,"INC"]
[null,null,null,"",null,"",null,"",null,"INC"]
[null,null,null,"",null,"",null,"",null,"INC"]
[null,null,null,"",null,"",null,"",null,"INC"]
[null,null,null,"",null,"",null,"",null,"INC"]
[null,null,null,"",null,"",null,"",null,"INC"]

{"sheet":"Crystal Oscillator","index":16,"n_rows":102,"n_cols":22,"rows_kept":102,"cut":false,"hidden":false,"merged":[[9,11,9,12]]}
["Crystal Oscillator Derating Worksheet (reference GSFC Document EEE-INST-002, Section C4, Table 4)",null,null,null,null,null,null,null,null,"CUI//SP-EXPT"]
[]
[null,"Notes:"]
[null,"1) For Maximum Supply/Input voltage, use manufacturer's recommended operating conditions but do not",null,null,null,null,null,null,null,null,null,null,null,null,null,null,null,null,null,"Digital",0.9,0.8]
[null,"    exceed 90% of maximum supply voltage.  For voltage regulators, derate Vin - Vout to 0.9.",null,null,null,null,null,null,null,null,null,null,null,null,null,null,null,null,null,"Linear",0.8,0.75]
[null,"2) For Maximum Specified Operating Junction Temperature, do not exceed Tj = 110°C, or 40°C below the "]
[null,"    manufacturer's maximum rating, whichever is lower or less."]
[]
[null,null,null,null,null,null,"      Select Part Type First"]
[null,null,"COMPONENT SPECIFICATION SECTION",null,null,null,null,null,null,null,null,"DERATING SECTION"]
["Component","Ref. Des.","Part Type","Maximum Supply Voltage/ Input Voltage, Rated","Voltage Derating Factor","Maximum Specified Operating Junction Temp., Rated","Junction Temp. Derating Factor","Maximum Output Current, Rated","GSFC Derated Voltage Rqmt","Actual Operating Voltage","GSFC Derated Temperature Requirement","Actual Operating Temp.","GSFC Derated Current Rqmt","Actual  Output Current","Pass/Fail","REMARKS"]
[null,null,null,null,{"$f":"IF(C12=\"Digital\", 0.9, IF(C12=\"Linear\", 0.8, \"\"))","v":""},null,{"$f":"IF(C12=\"Digital\", 0.8, IF(C12=\"Linear\", 0.75, \"\"))","v":""},null,{"$f":"IF((D12<>\"\")*AND(E12<>\"\"), D12*E12, \"\")","v":""},null,{"$f":"IF((F12<>\"\")*AND(G12<>\"\"), MIN(F12*G12, 110, (F12-40)), \"\")","v":""},null,{"$f":"IF(H12<>\"\", H12*0.8, \"\")","v":""},null,{"$f":"IF((I12<>\"\")*AND(J12<>\"\")*AND(K12<>\"\")*AND(L12<>\"\")*AND(M12<>\"\")*AND(N12<>\"\"), IF((J12<=I12)*AND(L12<=K12)*AND(N12<=M12),\"PASS\",\"FAIL\"), \"INC\")","v":"INC"}]
[null,null,null,null,"",null,"",null,"",null,"",null,"",null,"INC"]
[null,null,null,null,"",null,"",null,"",null,"",null,"",null,"INC"]
[null,null,null,null,"",null,"",null,"",null,"",null,"",null,"INC"]
[null,null,null,null,"",null,"",null,"",null,"",null,"",null,"INC"]
[null,null,null,null,"",null,"",null,"",null,"",null,"",null,"INC"]
[null,null,null,null,"",null,"",null,"",null,"",null,"",null,"INC"]
[null,null,null,null,"",null,"",null,"",null,"",null,"",null,"INC"]
[null,null,null,null,"",null,"",null,"",null,"",null,"",null,"INC"]
[null,null,null,null,"",null,"",null,"",null,"",null,"",null,"INC"]
[null,null,null,null,"",null,"",null,"",null,"",null,"",null,"INC"]
[null,null,null,null,"",null,"",null,"",null,"",null,"",null,"INC"]
[null,null,null,null,"",null,"",null,"",null,"",null,"",null,"INC"]
[null,null,null,null,"",null,"",null,"",null,"",null,"",null,"INC"]
[null,null,null,null,"",null,"",null,"",null,"",null,"",null,"INC"]
[null,null,null,null,"",null,"",null,"",null,"",null,"",null,"INC"]
[null,null,null,null,"",null,"",null,"",null,"",null,"",null,"INC"]
[null,null,null,null,"",null,"",null,"",null,"",null,"",null,"INC"]
[null,null,null,null,"",null,"",null,"",null,"",null,"",null,"INC"]
[null,null,null,null,"",null,"",null,"",null,"",null,"",null,"INC"]
[null,null,null,null,"",null,"",null,"",null,"",null,"",null,"INC"]
[null,null,null,null,"",null,"",null,"",null,"",null,"",null,"INC"]
[null,null,null,null,"",null,"",null,"",null,"",null,"",null,"INC"]
[null,null,null,null,"",null,"",null,"",null,"",null,"",null,"INC"]
[null,null,null,null,"",null,"",null,"",null,"",null,"",null,"INC"]
[null,null,null,null,"",null,"",null,"",null,"",null,"",null,"INC"]
[null,null,null,null,"",null,"",null,"",null,"",null,"",null,"INC"]
[null,null,null,null,"",null,"",null,"",null,"",null,"",null,"INC"]
[null,null,null,null,"",null,"",null,"",null,"",null,"",null,"INC"]
[null,null,null,null,"",null,"",null,"",null,"",null,"",null,"INC"]
[null,null,null,null,"",null,"",null,"",null,"",null,"",null,"INC"]
[null,null,null,null,"",null,"",null,"",null,"",null,"",null,"INC"]
[null,null,null,null,"",null,"",null,"",null,"",null,"",null,"INC"]
[null,null,null,null,"",null,"",null,"",null,"",null,"",null,"INC"]
[null,null,null,null,"",null,"",null,"",null,"",null,"",null,"INC"]
[null,null,null,null,"",null,"",null,"",null,"",null,"",null,"INC"]
[null,null,null,null,"",null,"",null,"",null,"",null,"",null,"INC"]
[null,null,null,null,"",null,"",null,"",null,"",null,"",null,"INC"]
[null,null,null,null,"",null,"",null,"",null,"",null,"",null,"INC"]
[null,null,null,null,"",null,"",null,"",null,"",null,"",null,"INC"]
[null,null,null,null,"",null,"",null,"",null,"",null,"",null,"INC"]
[null,null,null,null,"",null,"",null,"",null,"",null,"",null,"INC"]
[null,null,null,null,"",null,"",null,"",null,"",null,"",null,"INC"]
[null,null,null,null,"",null,"",null,"",null,"",null,"",null,"INC"]
[null,null,null,null,"",null,"",null,"",null,"",null,"",null,"INC"]
[null,null,null,null,"",null,"",null,"",null,"",null,"",null,"INC"]
[null,null,null,null,"",null,"",null,"",null,"",null,"",null,"INC"]
[null,null,null,null,"",null,"",null,"",null,"",null,"",null,"INC"]
[null,null,null,null,"",null,"",null,"",null,"",null,"",null,"INC"]
[null,null,null,null,"",null,"",null,"",null,"",null,"",null,"INC"]
[null,null,null,null,"",null,"",null,"",null,"",null,"",null,"INC"]
[null,null,null,null,"",null,"",null,"",null,"",null,"",null,"INC"]
[null,null,null,null,"",null,"",null,"",null,"",null,"",null,"INC"]
[null,null,null,null,"",null,"",null,"",null,"",null,"",null,"INC"]
[null,null,null,null,"",null,"",null,"",null,"",null,"",null,"INC"]
[null,null,null,null,"",null,"",null,"",null,"",null,"",null,"INC"]
[null,null,null,null,"",null,"",null,"",null,"",null,"",null,"INC"]
[null,null,null,null,"",null,"",null,"",null,"",null,"",null,"INC"]
[null,null,null,null,"",null,"",null,"",null,"",null,"",null,"INC"]
[null,null,null,null,"",null,"",null,"",null,"",null,"",null,"INC"]
[null,null,null,null,"",null,"",null,"",null,"",null,"",null,"INC"]
[null,null,null,null,"",null,"",null,"",null,"",null,"",null,"INC"]
[null,null,null,null,"",null,"",null,"",null,"",null,"",null,"INC"]
[null,null,null,null,"",null,"",null,"",null,"",null,"",null,"INC"]
[null,null,null,null,{"$f":"IF(C76=\"Digital\", 0.9, IF(C76=\"Linear\", 0.8, \"\"))","v":""},null,{"$f":"IF(C76=\"Digital\", 0.8, IF(C76=\"Linear\", 0.75, \"\"))","v":""},null,{"$f":"IF((D76<>\"\")*AND(E76<>\"\"), D76*E76, \"\")","v":""},null,{"$f":"IF((F76<>\"\")*AND(G76<>\"\"), MIN(F76*G76, 110, (F76-40)), \"\")","v":""},null,{"$f":"IF(H76<>\"\", H76*0.8, \"\")","v":""},null,{"$f":"IF((I76<>\"\")*AND(J76<>\"\")*AND(K76<>\"\")*AND(L76<>\"\")*AND(M76<>\"\")*AND(N76<>\"\"), IF((J76<=I76)*AND(L76<=K76)*AND(N76<=M76),\"PASS\",\"FAIL\"), \"INC\")","v":"INC"}]
[null,null,null,null,"",null,"",null,"",null,"",null,"",null,"INC"]
[null,null,null,null,"",null,"",null,"",null,"",null,"",null,"INC"]
[null,null,null,null,"",null,"",null,"",null,"",null,"",null,"INC"]
[null,null,null,null,"",null,"",null,"",null,"",null,"",null,"INC"]
[null,null,null,null,"",null,"",null,"",null,"",null,"",null,"INC"]
[null,null,null,null,"",null,"",null,"",null,"",null,"",null,"INC"]
[null,null,null,null,"",null,"",null,"",null,"",null,"",null,"INC"]
[null,null,null,null,"",null,"",null,"",null,"",null,"",null,"INC"]
[null,null,null,null,"",null,"",null,"",null,"",null,"",null,"INC"]
[null,null,null,null,"",null,"",null,"",null,"",null,"",null,"INC"]
[null,null,null,null,"",null,"",null,"",null,"",null,"",null,"INC"]
[null,null,null,null,"",null,"",null,"",null,"",null,"",null,"INC"]
[null,null,null,null,"",null,"",null,"",null,"",null,"",null,"INC"]
[null,null,null,null,"",null,"",null,"",null,"",null,"",null,"INC"]
[null,null,null,null,"",null,"",null,"",null,"",null,"",null,"INC"]
[null,null,null,null,"",null,"",null,"",null,"",null,"",null,"INC"]
[null,null,null,null,"",null,"",null,"",null,"",null,"",null,"INC"]
[null,null,null,null,"",null,"",null,"",null,"",null,"",null,"INC"]
[null,null,null,null,"",null,"",null,"",null,"",null,"",null,"INC"]
[null,null,null,null,"",null,"",null,"",null,"",null,"",null,"INC"]
[null,null,null,null,"",null,"",null,"",null,"",null,"",null,"INC"]
[null,null,null,null,"",null,"",null,"",null,"",null,"",null,"INC"]
[null,null,null,null,"",null,"",null,"",null,"",null,"",null,"INC"]
[null,null,null,null,"",null,"",null,"",null,"",null,"",null,"INC"]
[null,null,null,null,"",null,"",null,"",null,"",null,"",null,"INC"]
[null,null,null,null,"",null,"",null,"",null,"",null,"",null,"INC"]

{"sheet":"Junction Transistors","index":17,"n_rows":261,"n_cols":20,"rows_kept":261,"cut":false,"hidden":false,"merged":[[9,13,9,16]]}
["Transistor Derating Worksheet (reference GSFC Document EEE-INST-002, Section S1, Table 4)",null,null,null,null,null,null,null,null,"CUI//SP-EXPT"]
[]
["Notes:","1) Worst-case combination of DC, AC, and transient voltage should be no greater than the derated limit."]
[null,"2) Do not exceed T1 = 125 °C or 40 °C below the manufacturers' maximum rating, whichever is lower or less."]
[null,"3) Power MOSFET devices under certain conditions are very susceptible to catastrophic failure mechanisms, such as Single Event Burn-out (SEB) and Single Event "]
[null,"   Gate Rupture (SEGR), resulting from heavy ion impact. Consulting the project radiation engineer for further information and applicable derating criteria. "]
[]
["Junction Transistors"]
[]
[null,null,"COMPONENT SPECIFICATION SECTION",null,null,null,null,null,null,null,null,null,null,"DERATING SECTION"]
["Component","Ref. Des.","Maximum Supply Voltage/ Input Voltage, Rated","Voltage Derating Factor","Rated Power ","Power Derating Factor","Maximum Specified Operating Junction Temp, Rated","Junction Temp. Derating Factor ","Maximum Output Current, Rated","Current Derating Factor","GSFC Derated Voltage Rqmt","Actual Operating Voltage","GSFC Derated Power Rqmt","Actual Power ","GSFC Derated Junction Temp Rqmt","Actual Operating Junction Temp","GSFC Derated Output Current Rqmt","Actual  Output Current","Pass/Fail","REMARKS"]
[null,null,null,{"$f":"IF(C12<>\"\", 0.75, \"\")","v":""},null,{"$f":"IF(E12<>\"\", 0.6, \"\")","v":""},null,{"$f":"IF(G12<>\"\", 0.8, \"\")","v":""},null,{"$f":"IF(I12<>\"\", 0.75, \"\")","v":""},{"$f":"IF(C12<>\"\", C12*D12, \"\")","v":""},null,{"$f":"IF(E12<>\"\", E12*F12, \"\")","v":""},null,{"$f":"IF(G12<>\"\",MIN(G12*H12,125,(G12-40)),\"\")","v":""},null,{"$f":"IF(I12<>\"\", I12*J12, \"\")","v":""},null,{"$f":"IF((K12<>\"\")*AND(L12<>\"\")*AND(M12<>\"\")*AND(N12<>\"\")*AND(O12<>\"\")*AND(P12<>\"\")*AND(Q12<>\"\")*AND(R12<>\"\"), IF((L12<=K12)*AND(N12<=M12)*AND(P12<=O12)*AND(R12<=Q12),\"PASS\",\"FAIL\"), \"INC\")","v":"INC"}]
[null,null,null,"",null,"",null,"",null,"","",null,"",null,"",null,"",null,"INC"]
[null,null,null,"",null,"",null,"",null,"","",null,"",null,"",null,"",null,"INC"]
[null,null,null,"",null,"",null,"",null,"","",null,"",null,"",null,"",null,"INC"]
[null,null,null,"",null,"",null,"",null,"","",null,"",null,"",null,"",null,"INC"]
[null,null,null,"",null,"",null,"",null,"","",null,"",null,"",null,"",null,"INC"]
[null,null,null,"",null,"",null,"",null,"","",null,"",null,"",null,"",null,"INC"]
[null,null,null,"",null,"",null,"",null,"","",null,"",null,"",null,"",null,"INC"]
[null,null,null,"",null,"",null,"",null,"","",null,"",null,"",null,"",null,"INC"]
[null,null,null,"",null,"",null,"",null,"","",null,"",null,"",null,"",null,"INC"]
[null,null,null,"",null,"",null,"",null,"","",null,"",null,"",null,"",null,"INC"]
[null,null,null,"",null,"",null,"",null,"","",null,"",null,"",null,"",null,"INC"]
[null,null,null,"",null,"",null,"",null,"","",null,"",null,"",null,"",null,"INC"]
[null,null,null,"",null,"",null,"",null,"","",null,"",null,"",null,"",null,"INC"]
[null,null,null,"",null,"",null,"",null,"","",null,"",null,"",null,"",null,"INC"]
[null,null,null,"",null,"",null,"",null,"","",null,"",null,"",null,"",null,"INC"]
[null,null,null,"",null,"",null,"",null,"","",null,"",null,"",null,"",null,"INC"]
[null,null,null,"",null,"",null,"",null,"","",null,"",null,"",null,"",null,"INC"]
[null,null,null,"",null,"",null,"",null,"","",null,"",null,"",null,"",null,"INC"]
[null,null,null,"",null,"",null,"",null,"","",null,"",null,"",null,"",null,"INC"]
[null,null,null,"",null,"",null,"",null,"","",null,"",null,"",null,"",null,"INC"]
[null,null,null,"",null,"",null,"",null,"","",null,"",null,"",null,"",null,"INC"]
[null,null,null,"",null,"",null,"",null,"","",null,"",null,"",null,"",null,"INC"]
[null,null,null,"",null,"",null,"",null,"","",null,"",null,"",null,"",null,"INC"]
[null,null,null,"",null,"",null,"",null,"","",null,"",null,"",null,"",null,"INC"]
[null,null,null,"",null,"",null,"",null,"","",null,"",null,"",null,"",null,"INC"]
[null,null,null,"",null,"",null,"",null,"","",null,"",null,"",null,"",null,"INC"]
[null,null,null,"",null,"",null,"",null,"","",null,"",null,"",null,"",null,"INC"]
[null,null,null,"",null,"",null,"",null,"","",null,"",null,"",null,"",null,"INC"]
[null,null,null,"",null,"",null,"",null,"","",null,"",null,"",null,"",null,"INC"]
[null,null,null,"",null,"",null,"",null,"","",null,"",null,"",null,"",null,"INC"]
[null,null,null,"",null,"",null,"",null,"","",null,"",null,"",null,"",null,"INC"]
[null,null,null,"",null,"",null,"",null,"","",null,"",null,"",null,"",null,"INC"]
[null,null,null,"",null,"",null,"",null,"","",null,"",null,"",null,"",null,"INC"]
[null,null,null,"",null,"",null,"",null,"","",null,"",null,"",null,"",null,"INC"]
[null,null,null,"",null,"",null,"",null,"","",null,"",null,"",null,"",null,"INC"]
[null,null,null,"",null,"",null,"",null,"","",null,"",null,"",null,"",null,"INC"]
[null,null,null,"",null,"",null,"",null,"","",null,"",null,"",null,"",null,"INC"]
[null,null,null,"",null,"",null,"",null,"","",null,"",null,"",null,"",null,"INC"]
[null,null,null,"",null,"",null,"",null,"","",null,"",null,"",null,"",null,"INC"]
[null,null,null,"",null,"",null,"",null,"","",null,"",null,"",null,"",null,"INC"]
[null,null,null,"",null,"",null,"",null,"","",null,"",null,"",null,"",null,"INC"]
[null,null,null,"",null,"",null,"",null,"","",null,"",null,"",null,"",null,"INC"]
[null,null,null,"",null,"",null,"",null,"","",null,"",null,"",null,"",null,"INC"]
[null,null,null,"",null,"",null,"",null,"","",null,"",null,"",null,"",null,"INC"]
[null,null,null,"",null,"",null,"",null,"","",null,"",null,"",null,"",null,"INC"]
[null,null,null,"",null,"",null,"",null,"","",null,"",null,"",null,"",null,"INC"]
[null,null,null,"",null,"",null,"",null,"","",null,"",null,"",null,"",null,"INC"]
[null,null,null,"",null,"",null,"",null,"","",null,"",null,"",null,"",null,"INC"]
[null,null,null,"",null,"",null,"",null,"","",null,"",null,"",null,"",null,"INC"]
[null,null,null,"",null,"",null,"",null,"","",null,"",null,"",null,"",null,"INC"]
[null,null,null,"",null,"",null,"",null,"","",null,"",null,"",null,"",null,"INC"]
[null,null,null,"",null,"",null,"",null,"","",null,"",null,"",null,"",null,"INC"]
[null,null,null,"",null,"",null,"",null,"","",null,"",null,"",null,"",null,"INC"]
[null,null,null,"",null,"",null,"",null,"","",null,"",null,"",null,"",null,"INC"]
[null,null,null,"",null,"",null,"",null,"","",null,"",null,"",null,"",null,"INC"]
[null,null,null,"",null,"",null,"",null,"","",null,"",null,"",null,"",null,"INC"]
[null,null,null,"",null,"",null,"",null,"","",null,"",null,"",null,"",null,"INC"]
[null,null,null,"",null,"",null,"",null,"","",null,"",null,"",null,"",null,"INC"]
[null,null,null,"",null,"",null,"",null,"","",null,"",null,"",null,"",null,"INC"]
[null,null,null,"",null,"",null,"",null,"","",null,"",null,"",null,"",null,"INC"]
[null,null,null,"",null,"",null,"",null,"","",null,"",null,"",null,"",null,"INC"]
[null,null,null,"",null,"",null,"",null,"","",null,"",null,"",null,"",null,"INC"]
[null,null,null,"",null,"",null,"",null,"","",null,"",null,"",null,"",null,"INC"]
[null,null,null,{"$f":"IF(C76<>\"\", 0.75, \"\")","v":""},null,{"$f":"IF(E76<>\"\", 0.6, \"\")","v":""},null,{"$f":"IF(G76<>\"\", 0.8, \"\")","v":""},null,{"$f":"IF(I76<>\"\", 0.75, \"\")","v":""},{"$f":"IF(C76<>\"\", C76*D76, \"\")","v":""},null,{"$f":"IF(E76<>\"\", E76*F76, \"\")","v":""},null,{"$f":"IF(G76<>\"\",MIN(G76*H76,125,(G76-40)),\"\")","v":""},null,{"$f":"IF(I76<>\"\", I76*J76, \"\")","v":""},null,{"$f":"IF((K76<>\"\")*AND(L76<>\"\")*AND(M76<>\"\")*AND(N76<>\"\")*AND(O76<>\"\")*AND(P76<>\"\")*AND(Q76<>\"\")*AND(R76<>\"\"), IF((L76<=K76)*AND(N76<=M76)*AND(P76<=O76)*AND(R76<=Q76),\"PASS\",\"FAIL\"), \"INC\")","v":"INC"}]
[null,null,null,"",null,"",null,"",null,"","",null,"",null,"",null,"",null,"INC"]
[null,null,null,"",null,"",null,"",null,"","",null,"",null,"",null,"",null,"INC"]
[null,null,null,"",null,"",null,"",null,"","",null,"",null,"",null,"",null,"INC"]
[null,null,null,"",null,"",null,"",null,"","",null,"",null,"",null,"",null,"INC"]
[null,null,null,"",null,"",null,"",null,"","",null,"",null,"",null,"",null,"INC"]
[null,null,null,"",null,"",null,"",null,"","",null,"",null,"",null,"",null,"INC"]
[null,null,null,"",null,"",null,"",null,"","",null,"",null,"",null,"",null,"INC"]
[null,null,null,"",null,"",null,"",null,"","",null,"",null,"",null,"",null,"INC"]
[null,null,null,"",null,"",null,"",null,"","",null,"",null,"",null,"",null,"INC"]
[null,null,null,"",null,"",null,"",null,"","",null,"",null,"",null,"",null,"INC"]
[null,null,null,"",null,"",null,"",null,"","",null,"",null,"",null,"",null,"INC"]
[null,null,null,"",null,"",null,"",null,"","",null,"",null,"",null,"",null,"INC"]
[null,null,null,"",null,"",null,"",null,"","",null,"",null,"",null,"",null,"INC"]
[null,null,null,"",null,"",null,"",null,"","",null,"",null,"",null,"",null,"INC"]
[null,null,null,"",null,"",null,"",null,"","",null,"",null,"",null,"",null,"INC"]
[null,null,null,"",null,"",null,"",null,"","",null,"",null,"",null,"",null,"INC"]
[null,null,null,"",null,"",null,"",null,"","",null,"",null,"",null,"",null,"INC"]
[null,null,null,"",null,"",null,"",null,"","",null,"",null,"",null,"",null,"INC"]
[null,null,null,"",null,"",null,"",null,"","",null,"",null,"",null,"",null,"INC"]
[null,null,null,"",null,"",null,"",null,"","",null,"",null,"",null,"",null,"INC"]
[null,null,null,"",null,"",null,"",null,"","",null,"",null,"",null,"",null,"INC"]
[null,null,null,"",null,"",null,"",null,"","",null,"",null,"",null,"",null,"INC"]
[null,null,null,"",null,"",null,"",null,"","",null,"",null,"",null,"",null,"INC"]
[null,null,null,"",null,"",null,"",null,"","",null,"",null,"",null,"",null,"INC"]
[null,null,null,"",null,"",null,"",null,"","",null,"",null,"",null,"",null,"INC"]
[null,null,null,"",null,"",null,"",null,"","",null,"",null,"",null,"",null,"INC"]
[null,null,null,"",null,"",null,"",null,"","",null,"",null,"",null,"",null,"INC"]
[null,null,null,"",null,"",null,"",null,"","",null,"",null,"",null,"",null,"INC"]
[null,null,null,"",null,"",null,"",null,"","",null,"",null,"",null,"",null,"INC"]
[null,null,null,"",null,"",null,"",null,"","",null,"",null,"",null,"",null,"INC"]
[null,null,null,"",null,"",null,"",null,"","",null,"",null,"",null,"",null,"INC"]
[null,null,null,"",null,"",null,"",null,"","",null,"",null,"",null,"",null,"INC"]
[null,null,null,"",null,"",null,"",null,"","",null,"",null,"",null,"",null,"INC"]
[null,null,null,"",null,"",null,"",null,"","",null,"",null,"",null,"",null,"INC"]
[null,null,null,"",null,"",null,"",null,"","",null,"",null,"",null,"",null,"INC"]
[null,null,null,"",null,"",null,"",null,"","",null,"",null,"",null,"",null,"INC"]
[null,null,null,"",null,"",null,"",null,"","",null,"",null,"",null,"",null,"INC"]
[null,null,null,"",null,"",null,"",null,"","",null,"",null,"",null,"",null,"INC"]
[null,null,null,"",null,"",null,"",null,"","",null,"",null,"",null,"",null,"INC"]
[null,null,null,"",null,"",null,"",null,"","",null,"",null,"",null,"",null,"INC"]
[null,null,null,"",null,"",null,"",null,"","",null,"",null,"",null,"",null,"INC"]
[null,null,null,"",null,"",null,"",null,"","",null,"",null,"",null,"",null,"INC"]
[null,null,null,"",null,"",null,"",null,"","",null,"",null,"",null,"",null,"INC"]
[null,null,null,"",null,"",null,"",null,"","",null,"",null,"",null,"",null,"INC"]
[null,null,null,"",null,"",null,"",null,"","",null,"",null,"",null,"",null,"INC"]
[null,null,null,"",null,"",null,"",null,"","",null,"",null,"",null,"",null,"INC"]
[null,null,null,"",null,"",null,"",null,"","",null,"",null,"",null,"",null,"INC"]
[null,null,null,"",null,"",null,"",null,"","",null,"",null,"",null,"",null,"INC"]
[null,null,null,"",null,"",null,"",null,"","",null,"",null,"",null,"",null,"INC"]
[null,null,null,"",null,"",null,"",null,"","",null,"",null,"",null,"",null,"INC"]
[null,null,null,"",null,"",null,"",null,"","",null,"",null,"",null,"",null,"INC"]
[null,null,null,"",null,"",null,"",null,"","",null,"",null,"",null,"",null,"INC"]
[null,null,null,"",null,"",null,"",null,"","",null,"",null,"",null,"",null,"INC"]
[null,null,null,"",null,"",null,"",null,"","",null,"",null,"",null,"",null,"INC"]
[null,null,null,"",null,"",null,"",null,"","",null,"",null,"",null,"",null,"INC"]
[null,null,null,"",null,"",null,"",null,"","",null,"",null,"",null,"",null,"INC"]
[null,null,null,"",null,"",null,"",null,"","",null,"",null,"",null,"",null,"INC"]
[null,null,null,"",null,"",null,"",null,"","",null,"",null,"",null,"",null,"INC"]
[null,null,null,"",null,"",null,"",null,"","",null,"",null,"",null,"",null,"INC"]
[null,null,null,"",null,"",null,"",null,"","",null,"",null,"",null,"",null,"INC"]
[null,null,null,"",null,"",null,"",null,"","",null,"",null,"",null,"",null,"INC"]
[null,null,null,"",null,"",null,"",null,"","",null,"",null,"",null,"",null,"INC"]
[null,null,null,"",null,"",null,"",null,"","",null,"",null,"",null,"",null,"INC"]
[null,null,null,{"$f":"IF(C140<>\"\", 0.75, \"\")","v":""},null,{"$f":"IF(E140<>\"\", 0.6, \"\")","v":""},null,{"$f":"IF(G140<>\"\", 0.8, \"\")","v":""},null,{"$f":"IF(I140<>\"\", 0.75, \"\")","v":""},{"$f":"IF(C140<>\"\", C140*D140, \"\")","v":""},null,{"$f":"IF(E140<>\"\", E140*F140, \"\")","v":""},null,{"$f":"IF(G140<>\"\",MIN(G140*H140,125,(G140-40)),\"\")","v":""},null,{"$f":"IF(I140<>\"\", I140*J140, \"\")","v":""},null,{"$f":"IF((K140<>\"\")*AND(L140<>\"\")*AND(M140<>\"\")*AND(N140<>\"\")*AND(O140<>\"\")*AND(P140<>\"\")*AND(Q140<>\"\")*AND(R140<>\"\"), IF((L140<=K140)*AND(N140<=M140)*AND(P140<=O140)*AND(R140<=Q140),\"PASS\",\"FAIL\"), \"INC\")","v":"INC"}]
[null,null,null,"",null,"",null,"",null,"","",null,"",null,"",null,"",null,"INC"]
[null,null,null,"",null,"",null,"",null,"","",null,"",null,"",null,"",null,"INC"]
[null,null,null,"",null,"",null,"",null,"","",null,"",null,"",null,"",null,"INC"]
[null,null,null,"",null,"",null,"",null,"","",null,"",null,"",null,"",null,"INC"]
[null,null,null,"",null,"",null,"",null,"","",null,"",null,"",null,"",null,"INC"]
[null,null,null,"",null,"",null,"",null,"","",null,"",null,"",null,"",null,"INC"]
[null,null,null,"",null,"",null,"",null,"","",null,"",null,"",null,"",null,"INC"]
[null,null,null,"",null,"",null,"",null,"","",null,"",null,"",null,"",null,"INC"]
[null,null,null,"",null,"",null,"",null,"","",null,"",null,"",null,"",null,"INC"]
[null,null,null,"",null,"",null,"",null,"","",null,"",null,"",null,"",null,"INC"]
[null,null,null,"",null,"",null,"",null,"","",null,"",null,"",null,"",null,"INC"]
[null,null,null,"",null,"",null,"",null,"","",null,"",null,"",null,"",null,"INC"]
[null,null,null,"",null,"",null,"",null,"","",null,"",null,"",null,"",null,"INC"]
[null,null,null,"",null,"",null,"",null,"","",null,"",null,"",null,"",null,"INC"]
[null,null,null,"",null,"",null,"",null,"","",null,"",null,"",null,"",null,"INC"]
[null,null,null,"",null,"",null,"",null,"","",null,"",null,"",null,"",null,"INC"]
[null,null,null,"",null,"",null,"",null,"","",null,"",null,"",null,"",null,"INC"]
[null,null,null,"",null,"",null,"",null,"","",null,"",null,"",null,"",null,"INC"]
[null,null,null,"",null,"",null,"",null,"","",null,"",null,"",null,"",null,"INC"]
[null,null,null,"",null,"",null,"",null,"","",null,"",null,"",null,"",null,"INC"]
[null,null,null,"",null,"",null,"",null,"","",null,"",null,"",null,"",null,"INC"]
[null,null,null,"",null,"",null,"",null,"","",null,"",null,"",null,"",null,"INC"]
[null,null,null,"",null,"",null,"",null,"","",null,"",null,"",null,"",null,"INC"]
[null,null,null,"",null,"",null,"",null,"","",null,"",null,"",null,"",null,"INC"]
[null,null,null,"",null,"",null,"",null,"","",null,"",null,"",null,"",null,"INC"]
[null,null,null,"",null,"",null,"",null,"","",null,"",null,"",null,"",null,"INC"]
[null,null,null,"",null,"",null,"",null,"","",null,"",null,"",null,"",null,"INC"]
[null,null,null,"",null,"",null,"",null,"","",null,"",null,"",null,"",null,"INC"]
[null,null,null,"",null,"",null,"",null,"","",null,"",null,"",null,"",null,"INC"]
[null,null,null,"",null,"",null,"",null,"","",null,"",null,"",null,"",null,"INC"]
[null,null,null,"",null,"",null,"",null,"","",null,"",null,"",null,"",null,"INC"]
[null,null,null,"",null,"",null,"",null,"","",null,"",null,"",null,"",null,"INC"]
[null,null,null,"",null,"",null,"",null,"","",null,"",null,"",null,"",null,"INC"]
[null,null,null,"",null,"",null,"",null,"","",null,"",null,"",null,"",null,"INC"]
[null,null,null,"",null,"",null,"",null,"","",null,"",null,"",null,"",null,"INC"]
[null,null,null,"",null,"",null,"",null,"","",null,"",null,"",null,"",null,"INC"]
[null,null,null,"",null,"",null,"",null,"","",null,"",null,"",null,"",null,"INC"]
[null,null,null,"",null,"",null,"",null,"","",null,"",null,"",null,"",null,"INC"]
[null,null,null,"",null,"",null,"",null,"","",null,"",null,"",null,"",null,"INC"]
[null,null,null,"",null,"",null,"",null,"","",null,"",null,"",null,"",null,"INC"]
[null,null,null,"",null,"",null,"",null,"","",null,"",null,"",null,"",null,"INC"]
[null,null,null,"",null,"",null,"",null,"","",null,"",null,"",null,"",null,"INC"]
[null,null,null,"",null,"",null,"",null,"","",null,"",null,"",null,"",null,"INC"]
[null,null,null,"",null,"",null,"",null,"","",null,"",null,"",null,"",null,"INC"]
[null,null,null,"",null,"",null,"",null,"","",null,"",null,"",null,"",null,"INC"]
[null,null,null,"",null,"",null,"",null,"","",null,"",null,"",null,"",null,"INC"]
[null,null,null,"",null,"",null,"",null,"","",null,"",null,"",null,"",null,"INC"]
[null,null,null,"",null,"",null,"",null,"","",null,"",null,"",null,"",null,"INC"]
[null,null,null,"",null,"",null,"",null,"","",null,"",null,"",null,"",null,"INC"]
[null,null,null,"",null,"",null,"",null,"","",null,"",null,"",null,"",null,"INC"]
[null,null,null,"",null,"",null,"",null,"","",null,"",null,"",null,"",null,"INC"]
[null,null,null,"",null,"",null,"",null,"","",null,"",null,"",null,"",null,"INC"]
[null,null,null,"",null,"",null,"",null,"","",null,"",null,"",null,"",null,"INC"]
[null,null,null,"",null,"",null,"",null,"","",null,"",null,"",null,"",null,"INC"]
[null,null,null,"",null,"",null,"",null,"","",null,"",null,"",null,"",null,"INC"]
[null,null,null,"",null,"",null,"",null,"","",null,"",null,"",null,"",null,"INC"]
[null,null,null,"",null,"",null,"",null,"","",null,"",null,"",null,"",null,"INC"]
[null,null,null,"",null,"",null,"",null,"","",null,"",null,"",null,"",null,"INC"]
[null,null,null,"",null,"",null,"",null,"","",null,"",null,"",null,"",null,"INC"]
[null,null,null,"",null,"",null,"",null,"","",null,"",null,"",null,"",null,"INC"]
[null,null,null,"",null,"",null,"",null,"","",null,"",null,"",null,"",null,"INC"]
[null,null,null,"",null,"",null,"",null,"","",null,"",null,"",null,"",null,"INC"]
[null,null,null,"",null,"",null,"",null,"","",null,"",null,"",null,"",null,"INC"]
[null,null,null,{"$f":"IF(C204<>\"\", 0.75, \"\")","v":""},null,{"$f":"IF(E204<>\"\", 0.6, \"\")","v":""},null,{"$f":"IF(G204<>\"\", 0.8, \"\")","v":""},null,{"$f":"IF(I204<>\"\", 0.75, \"\")","v":""},{"$f":"IF(C204<>\"\", C204*D204, \"\")","v":""},null,{"$f":"IF(E204<>\"\", E204*F204, \"\")","v":""},null,{"$f":"IF(G204<>\"\",MIN(G204*H204,125,(G204-40)),\"\")","v":""},null,{"$f":"IF(I204<>\"\", I204*J204, \"\")","v":""},null,{"$f":"IF((K204<>\"\")*AND(L204<>\"\")*AND(M204<>\"\")*AND(N204<>\"\")*AND(O204<>\"\")*AND(P204<>\"\")*AND(Q204<>\"\")*AND(R204<>\"\"), IF((L204<=K204)*AND(N204<=M204)*AND(P204<=O204)*AND(R204<=Q204),\"PASS\",\"FAIL\"), \"INC\")","v":"INC"}]
[null,null,null,"",null,"",null,"",null,"","",null,"",null,"",null,"",null,"INC"]
[null,null,null,"",null,"",null,"",null,"","",null,"",null,"",null,"",null,"INC"]
[null,null,null,"",null,"",null,"",null,"","",null,"",null,"",null,"",null,"INC"]
[null,null,null,"",null,"",null,"",null,"","",null,"",null,"",null,"",null,"INC"]
[null,null,null,"",null,"",null,"",null,"","",null,"",null,"",null,"",null,"INC"]
[null,null,null,"",null,"",null,"",null,"","",null,"",null,"",null,"",null,"INC"]
[null,null,null,"",null,"",null,"",null,"","",null,"",null,"",null,"",null,"INC"]
[null,null,null,"",null,"",null,"",null,"","",null,"",null,"",null,"",null,"INC"]
[null,null,null,"",null,"",null,"",null,"","",null,"",null,"",null,"",null,"INC"]
[null,null,null,"",null,"",null,"",null,"","",null,"",null,"",null,"",null,"INC"]
[null,null,null,"",null,"",null,"",null,"","",null,"",null,"",null,"",null,"INC"]
[null,null,null,"",null,"",null,"",null,"","",null,"",null,"",null,"",null,"INC"]
[null,null,null,"",null,"",null,"",null,"","",null,"",null,"",null,"",null,"INC"]
[null,null,null,"",null,"",null,"",null,"","",null,"",null,"",null,"",null,"INC"]
[null,null,null,"",null,"",null,"",null,"","",null,"",null,"",null,"",null,"INC"]
[null,null,null,"",null,"",null,"",null,"","",null,"",null,"",null,"",null,"INC"]
[null,null,null,"",null,"",null,"",null,"","",null,"",null,"",null,"",null,"INC"]
[null,null,null,"",null,"",null,"",null,"","",null,"",null,"",null,"",null,"INC"]
[null,null,null,"",null,"",null,"",null,"","",null,"",null,"",null,"",null,"INC"]
[null,null,null,"",null,"",null,"",null,"","",null,"",null,"",null,"",null,"INC"]
[null,null,null,"",null,"",null,"",null,"","",null,"",null,"",null,"",null,"INC"]
[null,null,null,"",null,"",null,"",null,"","",null,"",null,"",null,"",null,"INC"]
[null,null,null,"",null,"",null,"",null,"","",null,"",null,"",null,"",null,"INC"]
[null,null,null,"",null,"",null,"",null,"","",null,"",null,"",null,"",null,"INC"]
[null,null,null,"",null,"",null,"",null,"","",null,"",null,"",null,"",null,"INC"]
[null,null,null,"",null,"",null,"",null,"","",null,"",null,"",null,"",null,"INC"]
[null,null,null,"",null,"",null,"",null,"","",null,"",null,"",null,"",null,"INC"]
[null,null,null,"",null,"",null,"",null,"","",null,"",null,"",null,"",null,"INC"]
[null,null,null,"",null,"",null,"",null,"","",null,"",null,"",null,"",null,"INC"]
[null,null,null,"",null,"",null,"",null,"","",null,"",null,"",null,"",null,"INC"]
[null,null,null,"",null,"",null,"",null,"","",null,"",null,"",null,"",null,"INC"]
[null,null,null,"",null,"",null,"",null,"","",null,"",null,"",null,"",null,"INC"]
[null,null,null,"",null,"",null,"",null,"","",null,"",null,"",null,"",null,"INC"]
[null,null,null,"",null,"",null,"",null,"","",null,"",null,"",null,"",null,"INC"]
[null,null,null,"",null,"",null,"",null,"","",null,"",null,"",null,"",null,"INC"]
[null,null,null,"",null,"",null,"",null,"","",null,"",null,"",null,"",null,"INC"]
[null,null,null,"",null,"",null,"",null,"","",null,"",null,"",null,"",null,"INC"]
[null,null,null,"",null,"",null,"",null,"","",null,"",null,"",null,"",null,"INC"]
[null,null,null,"",null,"",null,"",null,"","",null,"",null,"",null,"",null,"INC"]
[null,null,null,"",null,"",null,"",null,"","",null,"",null,"",null,"",null,"INC"]
[null,null,null,"",null,"",null,"",null,"","",null,"",null,"",null,"",null,"INC"]
[null,null,null,"",null,"",null,"",null,"","",null,"",null,"",null,"",null,"INC"]
[null,null,null,"",null,"",null,"",null,"","",null,"",null,"",null,"",null,"INC"]
[null,null,null,"",null,"",null,"",null,"","",null,"",null,"",null,"",null,"INC"]
[null,null,null,"",null,"",null,"",null,"","",null,"",null,"",null,"",null,"INC"]
[null,null,null,"",null,"",null,"",null,"","",null,"",null,"",null,"",null,"INC"]
[null,null,null,"",null,"",null,"",null,"","",null,"",null,"",null,"",null,"INC"]
[null,null,null,"",null,"",null,"",null,"","",null,"",null,"",null,"",null,"INC"]
[null,null,null,"",null,"",null,"",null,"","",null,"",null,"",null,"",null,"INC"]
[null,null,null,"",null,"",null,"",null,"","",null,"",null,"",null,"",null,"INC"]
[null,null,null,"",null,"",null,"",null,"","",null,"",null,"",null,"",null,"INC"]
[null,null,null,"",null,"",null,"",null,"","",null,"",null,"",null,"",null,"INC"]
[null,null,null,"",null,"",null,"",null,"","",null,"",null,"",null,"",null,"INC"]
[null,null,null,"",null,"",null,"",null,"","",null,"",null,"",null,"",null,"INC"]
[null,null,null,"",null,"",null,"",null,"","",null,"",null,"",null,"",null,"INC"]
[null,null,null,"",null,"",null,"",null,"","",null,"",null,"",null,"",null,"INC"]
[null,null,null,"",null,"",null,"",null,"","",null,"",null,"",null,"",null,"INC"]

{"sheet":"MOSFET Transistors","index":18,"n_rows":262,"n_cols":26,"rows_kept":262,"cut":false,"hidden":false,"merged":[[9,9,9,11]]}
["Transistor Derating Worksheet (reference GSFC Document EEE-INST-002, Section S1, Table 4)",null,null,null,null,null,null,null,null,"CUI//SP-EXPT"]
[]
["Notes:","1) Worst-case combination of DC, AC, and transient voltage should be no greater than the derated limit.",null,null,null,null,null,null,null,null,null,null,null,null,null,null,null,null,null,null,null,0.6,0.8,0.75,0.6,0.75]
[null,"2) Do not exceed T1 = 125 °C or 40 °C below the manufacturers' maximum rating, whichever is lower or less."]
[null,"3) Power MOSFET devices under certain conditions are very susceptible to catastrophic failure mechanisms, such as Single Event Burn-out (SEB) and Single Event"]
[null,"   Gate Rupture (SEGR), resulting from heavy ion impact.  Consulting the project radiation engineer for further information and applicable derating criteria. "]
[]
["MOSFET Transistors"]
[]
[null,null,"COMPONENT SPECIFICATION SECTION",null,null,null,null,null,null,null,null,null,null,"DERATING SECTION"]
["Component","Ref. Des.","Maximum Rated Power ","Rated Maximum Specified Operating Junction Temp.","Maximum Output Current, Rated","Maximum Rated Gate to Source Voltage","Source to Drain Voltage, Rated","GSFC Derated Power Rqmt","Actual Power ","GSFC Derated Junction Temp. Rqmt","Actual Operating Junction Temp.","GSFC Derated Output Current Rqmt","Actual  Output Current","GSFC Derated Gate to Source Voltage","Actual Gate to Source Voltage","GSFC Derated  Source to Drain Voltage","Actual Source to Drain Voltage","Pass/Fail","REMARKS"]
[null,null,null,null,null,null,null,{"$f":"IF(C12<>\"\", C12*$V$3, \"\")","v":""},null,{"$f":"IF(D12<>\"\",MIN(D12*$W$3,125,(D12-40)),\"\")","v":""},null,{"$f":"IF(E12<>\"\", E12*$X$3, \"\")","v":""},null,{"$f":"IF(F12<>\"\", F12*$Y$3, \"\")","v":""},null,{"$f":"IF(G12<>\"\", G12*$Z$3, \"\")","v":""},null,{"$f":"IF((H12<>\"\")*AND(I12<>\"\")*AND(J12<>\"\")*AND(K12<>\"\")*AND(L12<>\"\")*AND(M12<>\"\")*AND(N12<>\"\")*AND(O12<>\"\")*AND(P12<>\"\")*AND(Q12<>\"\"), IF((I12<=H12)*AND(K12<=J12)*AND(M12<=L12)*AND(O12<=N12)*AND(Q12<=P12),\"PASS\",\"FAIL\"), \"INC\")","v":"INC"}]
[null,null,null,null,null,null,null,"",null,"",null,"",null,"",null,"",null,"INC"]
[null,null,null,null,null,null,null,"",null,"",null,"",null,"",null,"",null,"INC"]
[null,null,null,null,null,null,null,"",null,"",null,"",null,"",null,"",null,"INC"]
[null,null,null,null,null,null,null,"",null,"",null,"",null,"",null,"",null,"INC"]
[null,null,null,null,null,null,null,"",null,"",null,"",null,"",null,"",null,"INC"]
[null,null,null,null,null,null,null,"",null,"",null,"",null,"",null,"",null,"INC"]
[null,null,null,null,null,null,null,"",null,"",null,"",null,"",null,"",null,"INC"]
[null,null,null,null,null,null,null,"",null,"",null,"",null,"",null,"",null,"INC"]
[null,null,null,null,null,null,null,"",null,"",null,"",null,"",null,"",null,"INC"]
[null,null,null,null,null,null,null,"",null,"",null,"",null,"",null,"",null,"INC"]
[null,null,null,null,null,null,null,"",null,"",null,"",null,"",null,"",null,"INC"]
[null,null,null,null,null,null,null,"",null,"",null,"",null,"",null,"",null,"INC"]
[null,null,null,null,null,null,null,"",null,"",null,"",null,"",null,"",null,"INC"]
[null,null,null,null,null,null,null,"",null,"",null,"",null,"",null,"",null,"INC"]
[null,null,null,null,null,null,null,"",null,"",null,"",null,"",null,"",null,"INC"]
[null,null,null,null,null,null,null,"",null,"",null,"",null,"",null,"",null,"INC"]
[null,null,null,null,null,null,null,"",null,"",null,"",null,"",null,"",null,"INC"]
[null,null,null,null,null,null,null,"",null,"",null,"",null,"",null,"",null,"INC"]
[null,null,null,null,null,null,null,"",null,"",null,"",null,"",null,"",null,"INC"]
[null,null,null,null,null,null,null,"",null,"",null,"",null,"",null,"",null,"INC"]
[null,null,null,null,null,null,null,"",null,"",null,"",null,"",null,"",null,"INC"]
[null,null,null,null,null,null,null,"",null,"",null,"",null,"",null,"",null,"INC"]
[null,null,null,null,null,null,null,"",null,"",null,"",null,"",null,"",null,"INC"]
[null,null,null,null,null,null,null,"",null,"",null,"",null,"",null,"",null,"INC"]
[null,null,null,null,null,null,null,"",null,"",null,"",null,"",null,"",null,"INC"]
[null,null,null,null,null,null,null,"",null,"",null,"",null,"",null,"",null,"INC"]
[null,null,null,null,null,null,null,"",null,"",null,"",null,"",null,"",null,"INC"]
[null,null,null,null,null,null,null,"",null,"",null,"",null,"",null,"",null,"INC"]
[null,null,null,null,null,null,null,"",null,"",null,"",null,"",null,"",null,"INC"]
[null,null,null,null,null,null,null,"",null,"",null,"",null,"",null,"",null,"INC"]
[null,null,null,null,null,null,null,"",null,"",null,"",null,"",null,"",null,"INC"]
[null,null,null,null,null,null,null,"",null,"",null,"",null,"",null,"",null,"INC"]
[null,null,null,null,null,null,null,"",null,"",null,"",null,"",null,"",null,"INC"]
[null,null,null,null,null,null,null,"",null,"",null,"",null,"",null,"",null,"INC"]
[null,null,null,null,null,null,null,"",null,"",null,"",null,"",null,"",null,"INC"]
[null,null,null,null,null,null,null,"",null,"",null,"",null,"",null,"",null,"INC"]
[null,null,null,null,null,null,null,"",null,"",null,"",null,"",null,"",null,"INC"]
[null,null,null,null,null,null,null,"",null,"",null,"",null,"",null,"",null,"INC"]
[null,null,null,null,null,null,null,"",null,"",null,"",null,"",null,"",null,"INC"]
[null,null,null,null,null,null,null,"",null,"",null,"",null,"",null,"",null,"INC"]
[null,null,null,null,null,null,null,"",null,"",null,"",null,"",null,"",null,"INC"]
[null,null,null,null,null,null,null,"",null,"",null,"",null,"",null,"",null,"INC"]
[null,null,null,null,null,null,null,"",null,"",null,"",null,"",null,"",null,"INC"]
[null,null,null,null,null,null,null,"",null,"",null,"",null,"",null,"",null,"INC"]
[null,null,null,null,null,null,null,"",null,"",null,"",null,"",null,"",null,"INC"]
[null,null,null,null,null,null,null,"",null,"",null,"",null,"",null,"",null,"INC"]
[null,null,null,null,null,null,null,"",null,"",null,"",null,"",null,"",null,"INC"]
[null,null,null,null,null,null,null,"",null,"",null,"",null,"",null,"",null,"INC"]
[null,null,null,null,null,null,null,"",null,"",null,"",null,"",null,"",null,"INC"]
[null,null,null,null,null,null,null,"",null,"",null,"",null,"",null,"",null,"INC"]
[null,null,null,null,null,null,null,"",null,"",null,"",null,"",null,"",null,"INC"]
[null,null,null,null,null,null,null,"",null,"",null,"",null,"",null,"",null,"INC"]
[null,null,null,null,null,null,null,"",null,"",null,"",null,"",null,"",null,"INC"]
[null,null,null,null,null,null,null,"",null,"",null,"",null,"",null,"",null,"INC"]
[null,null,null,null,null,null,null,"",null,"",null,"",null,"",null,"",null,"INC"]
[null,null,null,null,null,null,null,"",null,"",null,"",null,"",null,"",null,"INC"]
[null,null,null,null,null,null,null,"",null,"",null,"",null,"",null,"",null,"INC"]
[null,null,null,null,null,null,null,"",null,"",null,"",null,"",null,"",null,"INC"]
[null,null,null,null,null,null,null,"",null,"",null,"",null,"",null,"",null,"INC"]
[null,null,null,null,null,null,null,"",null,"",null,"",null,"",null,"",null,"INC"]
[null,null,null,null,null,null,null,"",null,"",null,"",null,"",null,"",null,"INC"]
[null,null,null,null,null,null,null,"",null,"",null,"",null,"",null,"",null,"INC"]
[null,null,null,null,null,null,null,"",null,"",null,"",null,"",null,"",null,"INC"]
[null,null,null,null,null,null,null,{"$f":"IF(C76<>\"\", C76*$V$3, \"\")","v":""},null,{"$f":"IF(D76<>\"\",MIN(D76*$W$3,125,(D76-40)),\"\")","v":""},null,{"$f":"IF(E76<>\"\", E76*$X$3, \"\")","v":""},null,{"$f":"IF(F76<>\"\", F76*$Y$3, \"\")","v":""},null,{"$f":"IF(G76<>\"\", G76*$Z$3, \"\")","v":""},null,{"$f":"IF((H76<>\"\")*AND(I76<>\"\")*AND(J76<>\"\")*AND(K76<>\"\")*AND(L76<>\"\")*AND(M76<>\"\")*AND(N76<>\"\")*AND(O76<>\"\")*AND(P76<>\"\")*AND(Q76<>\"\"), IF((I76<=H76)*AND(K76<=J76)*AND(M76<=L76)*AND(O76<=N76)*AND(Q76<=P76),\"PASS\",\"FAIL\"), \"INC\")","v":"INC"}]
[null,null,null,null,null,null,null,"",null,"",null,"",null,"",null,"",null,"INC"]
[null,null,null,null,null,null,null,"",null,"",null,"",null,"",null,"",null,"INC"]
[null,null,null,null,null,null,null,"",null,"",null,"",null,"",null,"",null,"INC"]
[null,null,null,null,null,null,null,"",null,"",null,"",null,"",null,"",null,"INC"]
[null,null,null,null,null,null,null,"",null,"",null,"",null,"",null,"",null,"INC"]
[null,null,null,null,null,null,null,"",null,"",null,"",null,"",null,"",null,"INC"]
[null,null,null,null,null,null,null,"",null,"",null,"",null,"",null,"",null,"INC"]
[null,null,null,null,null,null,null,"",null,"",null,"",null,"",null,"",null,"INC"]
[null,null,null,null,null,null,null,"",null,"",null,"",null,"",null,"",null,"INC"]
[null,null,null,null,null,null,null,"",null,"",null,"",null,"",null,"",null,"INC"]
[null,null,null,null,null,null,null,"",null,"",null,"",null,"",null,"",null,"INC"]
[null,null,null,null,null,null,null,"",null,"",null,"",null,"",null,"",null,"INC"]
[null,null,null,null,null,null,null,"",null,"",null,"",null,"",null,"",null,"INC"]
[null,null,null,null,null,null,null,"",null,"",null,"",null,"",null,"",null,"INC"]
[null,null,null,null,null,null,null,"",null,"",null,"",null,"",null,"",null,"INC"]
[null,null,null,null,null,null,null,"",null,"",null,"",null,"",null,"",null,"INC"]
[null,null,null,null,null,null,null,"",null,"",null,"",null,"",null,"",null,"INC"]
[null,null,null,null,null,null,null,"",null,"",null,"",null,"",null,"",null,"INC"]
[null,null,null,null,null,null,null,"",null,"",null,"",null,"",null,"",null,"INC"]
[null,null,null,null,null,null,null,"",null,"",null,"",null,"",null,"",null,"INC"]
[null,null,null,null,null,null,null,"",null,"",null,"",null,"",null,"",null,"INC"]
[null,null,null,null,null,null,null,"",null,"",null,"",null,"",null,"",null,"INC"]
[null,null,null,null,null,null,null,"",null,"",null,"",null,"",null,"",null,"INC"]
[null,null,null,null,null,null,null,"",null,"",null,"",null,"",null,"",null,"INC"]
[null,null,null,null,null,null,null,"",null,"",null,"",null,"",null,"",null,"INC"]
[null,null,null,null,null,null,null,"",null,"",null,"",null,"",null,"",null,"INC"]
[null,null,null,null,null,null,null,"",null,"",null,"",null,"",null,"",null,"INC"]
[null,null,null,null,null,null,null,"",null,"",null,"",null,"",null,"",null,"INC"]
[null,null,null,null,null,null,null,"",null,"",null,"",null,"",null,"",null,"INC"]
[null,null,null,null,null,null,null,"",null,"",null,"",null,"",null,"",null,"INC"]
[null,null,null,null,null,null,null,"",null,"",null,"",null,"",null,"",null,"INC"]
[null,null,null,null,null,null,null,"",null,"",null,"",null,"",null,"",null,"INC"]
[null,null,null,null,null,null,null,"",null,"",null,"",null,"",null,"",null,"INC"]
[null,null,null,null,null,null,null,"",null,"",null,"",null,"",null,"",null,"INC"]
[null,null,null,null,null,null,null,"",null,"",null,"",null,"",null,"",null,"INC"]
[null,null,null,null,null,null,null,"",null,"",null,"",null,"",null,"",null,"INC"]
[null,null,null,null,null,null,null,"",null,"",null,"",null,"",null,"",null,"INC"]
[null,null,null,null,null,null,null,"",null,"",null,"",null,"",null,"",null,"INC"]
[null,null,null,null,null,null,null,"",null,"",null,"",null,"",null,"",null,"INC"]
[null,null,null,null,null,null,null,"",null,"",null,"",null,"",null,"",null,"INC"]
[null,null,null,null,null,null,null,"",null,"",null,"",null,"",null,"",null,"INC"]
[null,null,null,null,null,null,null,"",null,"",null,"",null,"",null,"",null,"INC"]
[null,null,null,null,null,null,null,"",null,"",null,"",null,"",null,"",null,"INC"]
[null,null,null,null,null,null,null,"",null,"",null,"",null,"",null,"",null,"INC"]
[null,null,null,null,null,null,null,"",null,"",null,"",null,"",null,"",null,"INC"]
[null,null,null,null,null,null,null,"",null,"",null,"",null,"",null,"",null,"INC"]
[null,null,null,null,null,null,null,"",null,"",null,"",null,"",null,"",null,"INC"]
[null,null,null,null,null,null,null,"",null,"",null,"",null,"",null,"",null,"INC"]
[null,null,null,null,null,null,null,"",null,"",null,"",null,"",null,"",null,"INC"]
[null,null,null,null,null,null,null,"",null,"",null,"",null,"",null,"",null,"INC"]
[null,null,null,null,null,null,null,"",null,"",null,"",null,"",null,"",null,"INC"]
[null,null,null,null,null,null,null,"",null,"",null,"",null,"",null,"",null,"INC"]
[null,null,null,null,null,null,null,"",null,"",null,"",null,"",null,"",null,"INC"]
[null,null,null,null,null,null,null,"",null,"",null,"",null,"",null,"",null,"INC"]
[null,null,null,null,null,null,null,"",null,"",null,"",null,"",null,"",null,"INC"]
[null,null,null,null,null,null,null,"",null,"",null,"",null,"",null,"",null,"INC"]
[null,null,null,null,null,null,null,"",null,"",null,"",null,"",null,"",null,"INC"]
[null,null,null,null,null,null,null,"",null,"",null,"",null,"",null,"",null,"INC"]
[null,null,null,null,null,null,null,"",null,"",null,"",null,"",null,"",null,"INC"]
[null,null,null,null,null,null,null,"",null,"",null,"",null,"",null,"",null,"INC"]
[null,null,null,null,null,null,null,"",null,"",null,"",null,"",null,"",null,"INC"]
[null,null,null,null,null,null,null,"",null,"",null,"",null,"",null,"",null,"INC"]
[null,null,null,null,null,null,null,"",null,"",null,"",null,"",null,"",null,"INC"]
[null,null,null,null,null,null,null,{"$f":"IF(C140<>\"\", C140*$V$3, \"\")","v":""},null,{"$f":"IF(D140<>\"\",MIN(D140*$W$3,125,(D140-40)),\"\")","v":""},null,{"$f":"IF(E140<>\"\", E140*$X$3, \"\")","v":""},null,{"$f":"IF(F140<>\"\", F140*$Y$3, \"\")","v":""},null,{"$f":"IF(G140<>\"\", G140*$Z$3, \"\")","v":""},null,{"$f":"IF((H140<>\"\")*AND(I140<>\"\")*AND(J140<>\"\")*AND(K140<>\"\")*AND(L140<>\"\")*AND(M140<>\"\")*AND(N140<>\"\")*AND(O140<>\"\")*AND(P140<>\"\")*AND(Q140<>\"\"), IF((I140<=H140)*AND(K140<=J140)*AND(M140<=L140)*AND(O140<=N140)*AND(Q140<=P140),\"PASS\",\"FAIL\"), \"INC\")","v":"INC"}]
[null,null,null,null,null,null,null,"",null,"",null,"",null,"",null,"",null,"INC"]
[null,null,null,null,null,null,null,"",null,"",null,"",null,"",null,"",null,"INC"]
[null,null,null,null,null,null,null,"",null,"",null,"",null,"",null,"",null,"INC"]
[null,null,null,null,null,null,null,"",null,"",null,"",null,"",null,"",null,"INC"]
[null,null,null,null,null,null,null,"",null,"",null,"",null,"",null,"",null,"INC"]
[null,null,null,null,null,null,null,"",null,"",null,"",null,"",null,"",null,"INC"]
[null,null,null,null,null,null,null,"",null,"",null,"",null,"",null,"",null,"INC"]
[null,null,null,null,null,null,null,"",null,"",null,"",null,"",null,"",null,"INC"]
[null,null,null,null,null,null,null,"",null,"",null,"",null,"",null,"",null,"INC"]
[null,null,null,null,null,null,null,"",null,"",null,"",null,"",null,"",null,"INC"]
[null,null,null,null,null,null,null,"",null,"",null,"",null,"",null,"",null,"INC"]
[null,null,null,null,null,null,null,"",null,"",null,"",null,"",null,"",null,"INC"]
[null,null,null,null,null,null,null,"",null,"",null,"",null,"",null,"",null,"INC"]
[null,null,null,null,null,null,null,"",null,"",null,"",null,"",null,"",null,"INC"]
[null,null,null,null,null,null,null,"",null,"",null,"",null,"",null,"",null,"INC"]
[null,null,null,null,null,null,null,"",null,"",null,"",null,"",null,"",null,"INC"]
[null,null,null,null,null,null,null,"",null,"",null,"",null,"",null,"",null,"INC"]
[null,null,null,null,null,null,null,"",null,"",null,"",null,"",null,"",null,"INC"]
[null,null,null,null,null,null,null,"",null,"",null,"",null,"",null,"",null,"INC"]
[null,null,null,null,null,null,null,"",null,"",null,"",null,"",null,"",null,"INC"]
[null,null,null,null,null,null,null,"",null,"",null,"",null,"",null,"",null,"INC"]
[null,null,null,null,null,null,null,"",null,"",null,"",null,"",null,"",null,"INC"]
[null,null,null,null,null,null,null,"",null,"",null,"",null,"",null,"",null,"INC"]
[null,null,null,null,null,null,null,"",null,"",null,"",null,"",null,"",null,"INC"]
[null,null,null,null,null,null,null,"",null,"",null,"",null,"",null,"",null,"INC"]
[null,null,null,null,null,null,null,"",null,"",null,"",null,"",null,"",null,"INC"]
[null,null,null,null,null,null,null,"",null,"",null,"",null,"",null,"",null,"INC"]
[null,null,null,null,null,null,null,"",null,"",null,"",null,"",null,"",null,"INC"]
[null,null,null,null,null,null,null,"",null,"",null,"",null,"",null,"",null,"INC"]
[null,null,null,null,null,null,null,"",null,"",null,"",null,"",null,"",null,"INC"]
[null,null,null,null,null,null,null,"",null,"",null,"",null,"",null,"",null,"INC"]
[null,null,null,null,null,null,null,"",null,"",null,"",null,"",null,"",null,"INC"]
[null,null,null,null,null,null,null,"",null,"",null,"",null,"",null,"",null,"INC"]
[null,null,null,null,null,null,null,"",null,"",null,"",null,"",null,"",null,"INC"]
[null,null,null,null,null,null,null,"",null,"",null,"",null,"",null,"",null,"INC"]
[null,null,null,null,null,null,null,"",null,"",null,"",null,"",null,"",null,"INC"]
[null,null,null,null,null,null,null,"",null,"",null,"",null,"",null,"",null,"INC"]
[null,null,null,null,null,null,null,"",null,"",null,"",null,"",null,"",null,"INC"]
[null,null,null,null,null,null,null,"",null,"",null,"",null,"",null,"",null,"INC"]
[null,null,null,null,null,null,null,"",null,"",null,"",null,"",null,"",null,"INC"]
[null,null,null,null,null,null,null,"",null,"",null,"",null,"",null,"",null,"INC"]
[null,null,null,null,null,null,null,"",null,"",null,"",null,"",null,"",null,"INC"]
[null,null,null,null,null,null,null,"",null,"",null,"",null,"",null,"",null,"INC"]
[null,null,null,null,null,null,null,"",null,"",null,"",null,"",null,"",null,"INC"]
[null,null,null,null,null,null,null,"",null,"",null,"",null,"",null,"",null,"INC"]
[null,null,null,null,null,null,null,"",null,"",null,"",null,"",null,"",null,"INC"]
[null,null,null,null,null,null,null,"",null,"",null,"",null,"",null,"",null,"INC"]
[null,null,null,null,null,null,null,"",null,"",null,"",null,"",null,"",null,"INC"]
[null,null,null,null,null,null,null,"",null,"",null,"",null,"",null,"",null,"INC"]
[null,null,null,null,null,null,null,"",null,"",null,"",null,"",null,"",null,"INC"]
[null,null,null,null,null,null,null,"",null,"",null,"",null,"",null,"",null,"INC"]
[null,null,null,null,null,null,null,"",null,"",null,"",null,"",null,"",null,"INC"]
[null,null,null,null,null,null,null,"",null,"",null,"",null,"",null,"",null,"INC"]
[null,null,null,null,null,null,null,"",null,"",null,"",null,"",null,"",null,"INC"]
[null,null,null,null,null,null,null,"",null,"",null,"",null,"",null,"",null,"INC"]
[null,null,null,null,null,null,null,"",null,"",null,"",null,"",null,"",null,"INC"]
[null,null,null,null,null,null,null,"",null,"",null,"",null,"",null,"",null,"INC"]
[null,null,null,null,null,null,null,"",null,"",null,"",null,"",null,"",null,"INC"]
[null,null,null,null,null,null,null,"",null,"",null,"",null,"",null,"",null,"INC"]
[null,null,null,null,null,null,null,"",null,"",null,"",null,"",null,"",null,"INC"]
[null,null,null,null,null,null,null,"",null,"",null,"",null,"",null,"",null,"INC"]
[null,null,null,null,null,null,null,"",null,"",null,"",null,"",null,"",null,"INC"]
[null,null,null,null,null,null,null,"",null,"",null,"",null,"",null,"",null,"INC"]
[null,null,null,null,null,null,null,{"$f":"IF(C204<>\"\", C204*$V$3, \"\")","v":""},null,{"$f":"IF(D204<>\"\",MIN(D204*$W$3,125,(D204-40)),\"\")","v":""},null,{"$f":"IF(E204<>\"\", E204*$X$3, \"\")","v":""},null,{"$f":"IF(F204<>\"\", F204*$Y$3, \"\")","v":""},null,{"$f":"IF(G204<>\"\", G204*$Z$3, \"\")","v":""},null,{"$f":"IF((H204<>\"\")*AND(I204<>\"\")*AND(J204<>\"\")*AND(K204<>\"\")*AND(L204<>\"\")*AND(M204<>\"\")*AND(N204<>\"\")*AND(O204<>\"\")*AND(P204<>\"\")*AND(Q204<>\"\"), IF((I204<=H204)*AND(K204<=J204)*AND(M204<=L204)*AND(O204<=N204)*AND(Q204<=P204),\"PASS\",\"FAIL\"), \"INC\")","v":"INC"}]
[null,null,null,null,null,null,null,"",null,"",null,"",null,"",null,"",null,"INC"]
[null,null,null,null,null,null,null,"",null,"",null,"",null,"",null,"",null,"INC"]
[null,null,null,null,null,null,null,"",null,"",null,"",null,"",null,"",null,"INC"]
[null,null,null,null,null,null,null,"",null,"",null,"",null,"",null,"",null,"INC"]
[null,null,null,null,null,null,null,"",null,"",null,"",null,"",null,"",null,"INC"]
[null,null,null,null,null,null,null,"",null,"",null,"",null,"",null,"",null,"INC"]
[null,null,null,null,null,null,null,"",null,"",null,"",null,"",null,"",null,"INC"]
[null,null,null,null,null,null,null,"",null,"",null,"",null,"",null,"",null,"INC"]
[null,null,null,null,null,null,null,"",null,"",null,"",null,"",null,"",null,"INC"]
[null,null,null,null,null,null,null,"",null,"",null,"",null,"",null,"",null,"INC"]
[null,null,null,null,null,null,null,"",null,"",null,"",null,"",null,"",null,"INC"]
[null,null,null,null,null,null,null,"",null,"",null,"",null,"",null,"",null,"INC"]
[null,null,null,null,null,null,null,"",null,"",null,"",null,"",null,"",null,"INC"]
[null,null,null,null,null,null,null,"",null,"",null,"",null,"",null,"",null,"INC"]
[null,null,null,null,null,null,null,"",null,"",null,"",null,"",null,"",null,"INC"]
[null,null,null,null,null,null,null,"",null,"",null,"",null,"",null,"",null,"INC"]
[null,null,null,null,null,null,null,"",null,"",null,"",null,"",null,"",null,"INC"]
[null,null,null,null,null,null,null,"",null,"",null,"",null,"",null,"",null,"INC"]
[null,null,null,null,null,null,null,"",null,"",null,"",null,"",null,"",null,"INC"]
[null,null,null,null,null,null,null,"",null,"",null,"",null,"",null,"",null,"INC"]
[null,null,null,null,null,null,null,"",null,"",null,"",null,"",null,"",null,"INC"]
[null,null,null,null,null,null,null,"",null,"",null,"",null,"",null,"",null,"INC"]
[null,null,null,null,null,null,null,"",null,"",null,"",null,"",null,"",null,"INC"]
[null,null,null,null,null,null,null,"",null,"",null,"",null,"",null,"",null,"INC"]
[null,null,null,null,null,null,null,"",null,"",null,"",null,"",null,"",null,"INC"]
[null,null,null,null,null,null,null,"",null,"",null,"",null,"",null,"",null,"INC"]
[null,null,null,null,null,null,null,"",null,"",null,"",null,"",null,"",null,"INC"]
[null,null,null,null,null,null,null,"",null,"",null,"",null,"",null,"",null,"INC"]
[null,null,null,null,null,null,null,"",null,"",null,"",null,"",null,"",null,"INC"]
[null,null,null,null,null,null,null,"",null,"",null,"",null,"",null,"",null,"INC"]
[null,null,null,null,null,null,null,"",null,"",null,"",null,"",null,"",null,"INC"]
[null,null,null,null,null,null,null,"",null,"",null,"",null,"",null,"",null,"INC"]
[null,null,null,null,null,null,null,"",null,"",null,"",null,"",null,"",null,"INC"]
[null,null,null,null,null,null,null,"",null,"",null,"",null,"",null,"",null,"INC"]
[null,null,null,null,null,null,null,"",null,"",null,"",null,"",null,"",null,"INC"]
[null,null,null,null,null,null,null,"",null,"",null,"",null,"",null,"",null,"INC"]
[null,null,null,null,null,null,null,"",null,"",null,"",null,"",null,"",null,"INC"]
[null,null,null,null,null,null,null,"",null,"",null,"",null,"",null,"",null,"INC"]
[null,null,null,null,null,null,null,"",null,"",null,"",null,"",null,"",null,"INC"]
[null,null,null,null,null,null,null,"",null,"",null,"",null,"",null,"",null,"INC"]
[null,null,null,null,null,null,null,"",null,"",null,"",null,"",null,"",null,"INC"]
[null,null,null,null,null,null,null,"",null,"",null,"",null,"",null,"",null,"INC"]
[null,null,null,null,null,null,null,"",null,"",null,"",null,"",null,"",null,"INC"]
[null,null,null,null,null,null,null,"",null,"",null,"",null,"",null,"",null,"INC"]
[null,null,null,null,null,null,null,"",null,"",null,"",null,"",null,"",null,"INC"]
[null,null,null,null,null,null,null,"",null,"",null,"",null,"",null,"",null,"INC"]
[null,null,null,null,null,null,null,"",null,"",null,"",null,"",null,"",null,"INC"]
[null,null,null,null,null,null,null,"",null,"",null,"",null,"",null,"",null,"INC"]
[null,null,null,null,null,null,null,"",null,"",null,"",null,"",null,"",null,"INC"]
[null,null,null,null,null,null,null,"",null,"",null,"",null,"",null,"",null,"INC"]
[null,null,null,null,null,null,null,"",null,"",null,"",null,"",null,"",null,"INC"]
[null,null,null,null,null,null,null,"",null,"",null,"",null,"",null,"",null,"INC"]
[null,null,null,null,null,null,null,"",null,"",null,"",null,"",null,"",null,"INC"]
[null,null,null,null,null,null,null,"",null,"",null,"",null,"",null,"",null,"INC"]
[null,null,null,null,null,null,null,"",null,"",null,"",null,"",null,"",null,"INC"]
[null,null,null,null,null,null,null,"",null,"",null,"",null,"",null,"",null,"INC"]
[null,null,null,null,null,null,null,"",null,"",null,"",null,"",null,"",null,"INC"]
[null,null,null,null,null,null,null,"",null,"",null,"",null,"",null,"",null,"INC"]

{"sheet":"Filters","index":19,"n_rows":119,"n_cols":13,"rows_kept":119,"cut":false,"hidden":false,"merged":[[7,8,7,9]]}
["Filter Derating Worksheet (Reference GSFC Document EEE-INST-002, Section F2, Table 4)",null,null,null,null,null,null,null,null,"CUI//SP-EXPT"]
[]
[null,"Notes:"]
[null,"1) The derating criteria for current or voltage applies to the rated operating current or voltage, not the absolute maximum."]
[]
[]
[]
[null,null,"COMPONENT SPECIFICATION SECTION",null,null,null,null,null,"DERATING SECTION"]
["Component","Ref. Des.","Maximum Rated Current","Maximum Rated Voltage","Maximum Ambient Temp.","GSFC Derated Operating Current Rqmt","Actual Operating Current","GSFC Derated Operating Voltage Rqmt","Actual Operating Voltage","GSFC Derated Maximum Ambient Temp Rqmt","Actual Ambient Temp","Pass/Fail","REMARKS"]
[null,null,null,null,null,{"$f":"IF(C10<>\"\", C10*0.5, \"\")","v":""},null,{"$f":"IF(D10<>\"\", D10*0.5, \"\")","v":""},null,{"$f":"IF(E10=\"\",\"\",IF((E10-30)>85,85,(E10-30)))","v":""},null,{"$f":"IF((F10<>\"\")*AND(G10<>\"\")*AND(H10<>\"\")*AND(I10<>\"\")*AND(J10<>\"\")*AND(K10<>\"\"), IF((G10<=F10)*AND(I10<=H10)*AND(K10<=J10),\"PASS\",\"FAIL\"), \"INC\")","v":"INC"}]
[null,null,null,null,null,"",null,"",null,"",null,"INC"]
[null,null,null,null,null,"",null,"",null,"",null,"INC"]
[null,null,null,null,null,"",null,"",null,"",null,"INC"]
[null,null,null,null,null,"",null,"",null,"",null,"INC"]
[null,null,null,null,null,"",null,"",null,"",null,"INC"]
[null,null,null,null,null,"",null,"",null,"",null,"INC"]
[null,null,null,null,null,"",null,"",null,"",null,"INC"]
[null,null,null,null,null,"",null,"",null,"",null,"INC"]
[null,null,null,null,null,"",null,"",null,"",null,"INC"]
[null,null,null,null,null,"",null,"",null,"",null,"INC"]
[null,null,null,null,null,"",null,"",null,"",null,"INC"]
[null,null,null,null,null,"",null,"",null,"",null,"INC"]
[null,null,null,null,null,"",null,"",null,"",null,"INC"]
[null,null,null,null,null,"",null,"",null,"",null,"INC"]
[null,null,null,null,null,"",null,"",null,"",null,"INC"]
[null,null,null,null,null,"",null,"",null,"",null,"INC"]
[null,null,null,null,null,"",null,"",null,"",null,"INC"]
[null,null,null,null,null,"",null,"",null,"",null,"INC"]
[null,null,null,null,null,"",null,"",null,"",null,"INC"]
[null,null,null,null,null,"",null,"",null,"",null,"INC"]
[null,null,null,null,null,"",null,"",null,"",null,"INC"]
[null,null,null,null,null,"",null,"",null,"",null,"INC"]
[null,null,null,null,null,"",null,"",null,"",null,"INC"]
[null,null,null,null,null,"",null,"",null,"",null,"INC"]
[null,null,null,null,null,"",null,"",null,"",null,"INC"]
[null,null,null,null,null,"",null,"",null,"",null,"INC"]
[null,null,null,null,null,"",null,"",null,"",null,"INC"]
[null,null,null,null,null,"",null,"",null,"",null,"INC"]
[null,null,null,null,null,"",null,"",null,"",null,"INC"]
[null,null,null,null,null,"",null,"",null,"",null,"INC"]
[null,null,null,null,null,"",null,"",null,"",null,"INC"]
[null,null,null,null,null,"",null,"",null,"",null,"INC"]
[null,null,null,null,null,"",null,"",null,"",null,"INC"]
[null,null,null,null,null,"",null,"",null,"",null,"INC"]
[null,null,null,null,null,"",null,"",null,"",null,"INC"]
[null,null,null,null,null,"",null,"",null,{"$f":"IF(E46=\"\",\"\",IF((E46-30)>85,85,(E46-30)))","v":""},null,"INC"]
[null,null,null,null,null,"",null,"",null,{"$f":"IF(E47=\"\",\"\",IF((E47-30)>85,85,(E47-30)))","v":""},null,"INC"]
[null,null,null,null,null,"",null,"",null,"",null,"INC"]
[null,null,null,null,null,"",null,"",null,"",null,"INC"]
[null,null,null,null,null,"",null,"",null,"",null,"INC"]
[null,null,null,null,null,"",null,"",null,"",null,"INC"]
[null,null,null,null,null,"",null,"",null,"",null,"INC"]
[null,null,null,null,null,"",null,"",null,"",null,"INC"]
[null,null,null,null,null,"",null,"",null,"",null,"INC"]
[null,null,null,null,null,"",null,"",null,"",null,"INC"]
[null,null,null,null,null,"",null,"",null,"",null,"INC"]
[null,null,null,null,null,"",null,"",null,"",null,"INC"]
[null,null,null,null,null,"",null,"",null,"",null,"INC"]
[null,null,null,null,null,"",null,"",null,"",null,"INC"]
[null,null,null,null,null,"",null,"",null,"",null,"INC"]
[null,null,null,null,null,"",null,"",null,"",null,"INC"]
[null,null,null,null,null,"",null,"",null,"",null,"INC"]
[null,null,null,null,null,"",null,"",null,"",null,"INC"]
[null,null,null,null,null,"",null,"",null,"",null,"INC"]
[null,null,null,null,null,"",null,"",null,"",null,"INC"]
[null,null,null,null,null,"",null,"",null,"",null,"INC"]
[null,null,null,null,null,"",null,"",null,"",null,"INC"]
[null,null,null,null,null,"",null,"",null,"",null,"INC"]
[null,null,null,null,null,"",null,"",null,"",null,"INC"]
[null,null,null,null,null,"",null,"",null,"",null,"INC"]
[null,null,null,null,null,"",null,"",null,"",null,"INC"]
[null,null,null,null,null,"",null,"",null,"",null,"INC"]
[null,null,null,null,null,"",null,"",null,"",null,"INC"]
[null,null,null,null,null,{"$f":"IF(C74<>\"\", C74*0.5, \"\")","v":""},null,{"$f":"IF(D74<>\"\", D74*0.5, \"\")","v":""},null,"",null,{"$f":"IF((F74<>\"\")*AND(G74<>\"\")*AND(H74<>\"\")*AND(I74<>\"\")*AND(J74<>\"\")*AND(K74<>\"\"), IF((G74<=F74)*AND(I74<=H74)*AND(K74<=J74),\"PASS\",\"FAIL\"), \"INC\")","v":"INC"}]
[null,null,null,null,null,"",null,"",null,"",null,"INC"]
[null,null,null,null,null,"",null,"",null,"",null,"INC"]
[null,null,null,null,null,"",null,"",null,"",null,"INC"]
[null,null,null,null,null,"",null,"",null,"",null,"INC"]
[null,null,null,null,null,"",null,"",null,"",null,"INC"]
[null,null,null,null,null,"",null,"",null,"",null,"INC"]
[null,null,null,null,null,"",null,"",null,"",null,"INC"]
[null,null,null,null,null,"",null,"",null,"",null,"INC"]
[null,null,null,null,null,"",null,"",null,{"$f":"IF(E83=\"\",\"\",IF((E83-30)>85,85,(E83-30)))","v":""},null,"INC"]
[null,null,null,null,null,"",null,"",null,{"$f":"IF(E84=\"\",\"\",IF((E84-30)>85,85,(E84-30)))","v":""},null,"INC"]
[null,null,null,null,null,"",null,"",null,"",null,"INC"]
[null,null,null,null,null,"",null,"",null,"",null,"INC"]
[null,null,null,null,null,"",null,"",null,"",null,"INC"]
[null,null,null,null,null,"",null,"",null,"",null,"INC"]
[null,null,null,null,null,"",null,"",null,"",null,"INC"]
[null,null,null,null,null,"",null,"",null,"",null,"INC"]
[null,null,null,null,null,"",null,"",null,"",null,"INC"]
[null,null,null,null,null,"",null,"",null,"",null,"INC"]
[null,null,null,null,null,"",null,"",null,"",null,"INC"]
[null,null,null,null,null,"",null,"",null,"",null,"INC"]
[null,null,null,null,null,"",null,"",null,"",null,"INC"]
[null,null,null,null,null,"",null,"",null,"",null,"INC"]
[null,null,null,null,null,"",null,"",null,"",null,"INC"]
[null,null,null,null,null,"",null,"",null,"",null,"INC"]
[null,null,null,null,null,"",null,"",null,"",null,"INC"]
[null,null,null,null,null,"",null,"",null,"",null,"INC"]
[null,null,null,null,null,"",null,"",null,"",null,"INC"]
[null,null,null,null,null,"",null,"",null,"",null,"INC"]
[null,null,null,null,null,"",null,"",null,"",null,"INC"]
[null,null,null,null,null,"",null,"",null,"",null,"INC"]
[null,null,null,null,null,"",null,"",null,"",null,"INC"]
[null,null,null,null,null,"",null,"",null,"",null,"INC"]
[null,null,null,null,null,"",null,"",null,"",null,"INC"]
[null,null,null,null,null,"",null,"",null,"",null,"INC"]
[null,null,null,null,null,"",null,"",null,"",null,"INC"]
[null,null,null,null,null,"",null,"",null,"",null,"INC"]
[null,null,null,null,null,"",null,"",null,"",null,"INC"]
[null,null,null,null,null,"",null,"",null,"",null,"INC"]
[null,null,null,null,null,"",null,"",null,"",null,"INC"]
[null,null,null,null,null,"",null,"",null,"",null,"INC"]
[null,null,null,null,null,"",null,"",null,"",null,"INC"]
[null,null,null,null,null,"",null,"",null,"",null,"INC"]
[null,null,null,null,null,"",null,"",null,"",null,"INC"]
[null,null,null,null,null,"",null,"",null,"",null,"INC"]
[null,null,null,null,null,"",null,"",null,"",null,"INC"]

{"sheet":"Solid Body Fuses","index":20,"n_rows":89,"n_cols":9,"rows_kept":89,"cut":false,"hidden":false,"merged":[]}
["Solid Body Fuse Derating Worksheet (Based on planned updates EEE-INST-002 as of December 2019) ",null,null,null,null,null,null,null,"CUI//SP-EXPT"]
[]
["Notes:"]
["The solid body fuses are not affected for internal arcing issue as normally seen in hollow body fuses. "]
[]
["SOLID BODY FUSES WORKSHEET",null,null,"Applies to MIL-PRF-23419/12D FM12 solid Body fuses only"]
[]
[null,null,"COMPONENT SPECIFICATION SECTION"]
["Component","Ref. Des.","Fuse Current Rating (Amperes) ","Fuse Case Temperature  110°C Maximum (Use 60 °C pending thermal analysis)","Current Derating Factor","GSFC Derated Current Rqmt","Actual Fuse Current","Pass/Fail","REMARKS"]
[null,null,null,null,{"$f":"IF(C10<>\"\", 0.8, \"\")","v":""},{"$f":"IF(C10=\"\",\"\",(C10*E10))","v":""},null,{"$f":"IF((F10<>\"\")*AND(G10<>\"\"), IF((G10<=F10)*AND(D10<=110),\"PASS\",\"FAIL\"), \"INC\")","v":"INC"}]
[null,null,null,null,{"$f":"IF(C11<>\"\", 0.8, \"\")","v":""},{"$f":"IF(C11=\"\",\"\",(C11*E11))","v":""},null,{"$f":"IF((F11<>\"\")*AND(G11<>\"\"), IF((G11<=F11)*AND(D11<=110),\"PASS\",\"FAIL\"), \"INC\")","v":"INC"}]
[null,null,null,null,"","",null,"INC"]
[null,null,null,null,"","",null,"INC"]
[null,null,null,null,"","",null,"INC"]
[null,null,null,null,"","",null,"INC"]
[null,null,null,null,"","",null,"INC"]
[null,null,null,null,"","",null,"INC"]
[null,null,null,null,"","",null,"INC"]
[null,null,null,null,"","",null,"INC"]
[null,null,null,null,"","",null,"INC"]
[null,null,null,null,"","",null,"INC"]
[null,null,null,null,"","",null,"INC"]
[null,null,null,null,"","",null,"INC"]
[null,null,null,null,"","",null,"INC"]
[null,null,null,null,"","",null,"INC"]
[null,null,null,null,"","",null,"INC"]
[null,null,null,null,"","",null,"INC"]
[null,null,null,null,"","",null,"INC"]
[null,null,null,null,"","",null,"INC"]
[null,null,null,null,"","",null,"INC"]
[null,null,null,null,"","",null,"INC"]
[null,null,null,null,"","",null,"INC"]
[null,null,null,null,"","",null,"INC"]
[null,null,null,null,"","",null,"INC"]
[null,null,null,null,"","",null,"INC"]
[null,null,null,null,"","",null,"INC"]
[null,null,null,null,"","",null,"INC"]
[null,null,null,null,"","",null,"INC"]
[null,null,null,null,"","",null,"INC"]
[null,null,null,null,"","",null,"INC"]
[null,null,null,null,"","",null,"INC"]
[null,null,null,null,"","",null,"INC"]
[null,null,null,null,"","",null,"INC"]
[null,null,null,null,"","",null,"INC"]
[null,null,null,null,"","",null,"INC"]
[null,null,null,null,"","",null,"INC"]
[null,null,null,null,"","",null,"INC"]
[null,null,null,null,"","",null,"INC"]
[null,null,null,null,"","",null,"INC"]
[null,null,null,null,"","",null,"INC"]
[null,null,null,null,"","",null,"INC"]
[null,null,null,null,"","",null,"INC"]
[null,null,null,null,"","",null,"INC"]
[null,null,null,null,"","",null,"INC"]
[null,null,null,null,"","",null,"INC"]
[null,null,null,null,"","",null,"INC"]
[null,null,null,null,"","",null,"INC"]
[null,null,null,null,"","",null,"INC"]
[null,null,null,null,"","",null,"INC"]
[null,null,null,null,"","",null,"INC"]
[null,null,null,null,"","",null,"INC"]
[null,null,null,null,"","",null,"INC"]
[null,null,null,null,"","",null,"INC"]
[null,null,null,null,"","",null,"INC"]
[null,null,null,null,"","",null,"INC"]
[null,null,null,null,"","",null,"INC"]
[null,null,null,null,"","",null,"INC"]
[null,null,null,null,"","",null,"INC"]
[null,null,null,null,"","",null,"INC"]
[null,null,null,null,"","",null,"INC"]
[null,null,null,null,"","",null,"INC"]
[null,null,null,null,"","",null,"INC"]
[null,null,null,null,"","",null,"INC"]
[null,null,null,null,"","",null,"INC"]
[null,null,null,null,{"$f":"IF(C75<>\"\", 0.8, \"\")","v":""},{"$f":"IF(C75=\"\",\"\",(C75*E75))","v":""},null,{"$f":"IF((F75<>\"\")*AND(G75<>\"\"), IF((G75<=F75)*AND(D75<=110),\"PASS\",\"FAIL\"), \"INC\")","v":"INC"}]
[null,null,null,null,"","",null,"INC"]
[null,null,null,null,"","",null,"INC"]
[null,null,null,null,"","",null,"INC"]
[null,null,null,null,"","",null,"INC"]
[null,null,null,null,"","",null,"INC"]
[null,null,null,null,"","",null,"INC"]
[null,null,null,null,"","",null,"INC"]
[null,null,null,null,"","",null,"INC"]
[null,null,null,null,"","",null,"INC"]
[null,null,null,null,"","",null,"INC"]
[null,null,null,null,"","",null,"INC"]
[null,null,null,null,"","",null,"INC"]
[null,null,null,null,"","",null,"INC"]
[null,null,null,null,"","",null,"INC"]

{"sheet":"Hollow Body Fuses","index":21,"n_rows":99,"n_cols":19,"rows_kept":99,"cut":false,"hidden":false,"merged":[]}
["Fuse Derating Worksheet (reference GSFC Document EEE-INST-002, Section F3 Table 4)",null,null,null,null,null,null,null,null,"CUI//SP-EXPT"]
[]
["Notes:",null,null,null,null,null,null,null,null,null,null,null,null,null,null,null,null,2,0.5]
["1) For the Current Derating Factor, there is an additional derating of 0.2%/°C for an increase in the temperature of fuse body above 25°C.",null,null,null,null,null,null,null,null,null,null,null,null,null,null,null,null,2.5,0.5]
["2) Fuses are specified to interrupt within a maximum of 5 seconds when driven at 200% of their rated current for nominal ratings up to and including 10 amperes. A fuse with a nominal rating of 15 amperes is ",null,null,null,null,null,null,null,null,null,null,null,null,null,null,null,null,3,0.5]
["    specified to interrupt within a maximum of 10 seconds when driven at 200% of its rated current.  The power supply shall be capable of delivering appropriate levels of current to achieve short fusing times.",null,null,null,null,null,null,null,null,null,null,null,null,null,null,null,null,4,0.5]
["3) In a space environment, the possible escape of air from inside the fuses reduces the filament cooling mechanism (heat transfer by conduction). This lowers ",null,null,null,null,null,null,null,null,null,null,null,null,null,null,null,null,5,0.5]
["    the blow current rating and decreases current capacity with time, making it necessary to derate current ratings on fuses used in space applications.",null,null,null,null,null,null,null,null,null,null,null,null,null,null,null,null,7,0.5]
["4) Fuses rated at 1/2 ampere or below are especially affected by loss of air; thus, their derating factors are larger.",null,null,null,null,null,null,null,null,null,null,null,null,null,null,null,null,10,0.5]
["5) Current derating factors are based on data from fuses mounted on PC boards & conformally coated. Other types of mountings require project office approval. It should be noted that the lifetime of fuses is controlled by two ",null,null,null,null,null,null,null,null,null,null,null,null,null,null," ",null,15,0.5]
["    factors; cold resistance of fuse & heat sinking provided by an installer. The thermal resistance of fuse to a thermal ground is very important, as is the case with power transistors & power diodes mounting on PC boards.",null,null,null,null,null,null,null,null,null,null,null,null,null,null,null,null,1,0.45]
["6) Recent studies have shown the occurrence of enduring arcs in fuses rated at 125 volts when the applied voltage is greater than 50 volts. Therefore, the voltages on these fuses should be derated to 50 volts or less.",null,null,null,null,null,null,null,null,null,null,null,null,null,null,null,null,1.5,0.45]
["7) Electrical transients produce thermal cycling and mechanical fatigue that could affect the life of the fuse.  For each application, the capability of the fuse to withstand the expected ",null,null,null,null,null,null,null,null,null,null,null,null,null,null,null,null,0.75,0.4]
["    pulse conditions should be established by considering the pulse cycle withstanding capability for nominal I^2*t (energy let through the fuse) specified by the manufacturer.",null,null,null,null,null,null,null,null,null,null,null,null,null,null,null,null,0.5,0.4]
[null,null,null,null,null,null,null,null,null,null,null,null,null,null,null,null,null,0.375,0.35]
["HOLLOW BODY FUSE (FM08) WORKSHEET",null,null,null,"DO NOT USE THIS SHEET FOR SOLID BODY FUSES (FM12)",null,null,null,null,null,null,null,null,null,null,null,null,0.25,0.3]
[null,null,null,null,null,null,null,null,null,null,null,null,null,null,null,null,null,0.125,0.25]
[null,null,"COMPONENT SPECIFICATION SECTION",null,null,null,null,null,"DERATING SECTION"]
["Component","Ref. Des.","Fuse Current Rating (Amperes) @ 25°C","Fuse Ambient Temp. 125 °C Maximum (Use 60 °C pending thermal analysis)","Current Derating Factor","GSFC Derated Current Requirement","Actual Fuse Current","Short Circuit Voltage across the Fuse (not more than 50 volt see note 6)","Pass/Fail","Project Approval Required for use of this value","REMARKS"]
[null,null,null,{"$f":"IF(C20<>\"\", 60, \"\")","v":""},{"$f":"IF(C20>1.8, 0.5, IF(C20>0.9, 0.45, IF(C20>0.4, 0.4, IF(C20>0.3, 0.35, IF(C20>0.2, 0.3, IF(C20>0.1, 0.25, \"\"))))))","v":""},{"$f":"IF(C20=\"\",\"\",(C20*(E20-((D20-25)*0.002))))","v":""},null,null,{"$f":"IF((G20<>\"\")*AND(F20<>\"\")*AND(H20<>\"\"), IF((G20<=F20)*AND(H20<=50),\"PASS\",\"FAIL\"), \"INC\")","v":"INC"},{"$f":"IF(C20>0,IF(C20<=0.5,\"YES\",\"\"),\"\")","v":""}]
[null,null,null,"",{"$f":"IF(C21>1.8, 0.5, IF(C21>0.9, 0.45, IF(C21>0.4, 0.4, IF(C21>0.3, 0.35, IF(C21>0.2, 0.3, IF(C21>0.1, 0.25, \"\"))))))","v":""},{"$f":"IF(C21=\"\",\"\",(C21*(E21-((D21-25)*0.002))))","v":""},null,null,"INC",""]
[null,null,null,"","","",null,null,"INC",""]
[null,null,null,"","","",null,null,"INC",""]
[null,null,null,"","","",null,null,"INC",""]
[null,null,null,"","","",null,null,"INC",""]
[null,null,null,"","","",null,null,"INC",""]
[null,null,null,"","","",null,null,"INC",""]
[null,null,null,"","","",null,null,"INC",""]
[null,null,null,"","","",null,null,"INC",""]
[null,null,null,"","","",null,null,"INC",""]
[null,null,null,"","","",null,null,"INC",""]
[null,null,null,"","","",null,null,"INC",""]
[null,null,null,"","","",null,null,"INC",""]
[null,null,null,"","","",null,null,"INC",""]
[null,null,null,"","","",null,null,"INC",""]
[null,null,null,"","","",null,null,"INC",""]
[null,null,null,"","","",null,null,"INC",""]
[null,null,null,"","","",null,null,"INC",""]
[null,null,null,"","","",null,null,"INC",""]
[null,null,null,"","","",null,null,"INC",""]
[null,null,null,"","","",null,null,"INC",""]
[null,null,null,"","","",null,null,"INC",""]
[null,null,null,"","","",null,null,"INC",""]
[null,null,null,"","","",null,null,"INC",""]
[null,null,null,"","","",null,null,"INC",""]
[null,null,null,"","","",null,null,"INC",""]
[null,null,null,"","","",null,null,"INC",""]
[null,null,null,"","","",null,null,"INC",""]
[null,null,null,"","","",null,null,"INC",""]
[null,null,null,"","","",null,null,"INC",""]
[null,null,null,"","","",null,null,"INC",""]
[null,null,null,"","","",null,null,"INC",""]
[null,null,null,"","","",null,null,"INC",""]
[null,null,null,"","","",null,null,"INC",""]
[null,null,null,"","","",null,null,"INC",""]
[null,null,null,"","","",null,null,"INC",""]
[null,null,null,"","","",null,null,"INC",""]
[null,null,null,"","","",null,null,"INC",""]
[null,null,null,"","","",null,null,"INC",""]
[null,null,null,"","","",null,null,"INC",""]
[null,null,null,"","","",null,null,"INC",""]
[null,null,null,"","","",null,null,"INC",""]
[null,null,null,"","","",null,null,"INC",""]
[null,null,null,"","","",null,null,"INC",""]
[null,null,null,"","","",null,null,"INC",""]
[null,null,null,"","","",null,null,"INC",""]
[null,null,null,"","","",null,null,"INC",""]
[null,null,null,"","","",null,null,"INC",""]
[null,null,null,"","","",null,null,"INC",""]
[null,null,null,"","","",null,null,"INC",""]
[null,null,null,"","","",null,null,"INC",""]
[null,null,null,"","","",null,null,"INC",""]
[null,null,null,"","","",null,null,"INC",""]
[null,null,null,"","","",null,null,"INC",""]
[null,null,null,"","","",null,null,"INC",""]
[null,null,null,"","","",null,null,"INC",""]
[null,null,null,"","","",null,null,"INC",""]
[null,null,null,"","","",null,null,"INC",""]
[null,null,null,"","","",null,null,"INC",""]
[null,null,null,"","","",null,null,"INC",""]
[null,null,null,"","","",null,null,"INC",""]
[null,null,null,"","","",null,null,"INC",""]
[null,null,null,"","","",null,null,"INC",""]
[null,null,null,{"$f":"IF(C84<>\"\", 60, \"\")","v":""},"","",null,null,{"$f":"IF((G84<>\"\")*AND(F84<>\"\")*AND(H84<>\"\"), IF((G84<=F84)*AND(H84<=50),\"PASS\",\"FAIL\"), \"INC\")","v":"INC"},{"$f":"IF(C84>0,IF(C84<=0.5,\"YES\",\"\"),\"\")","v":""}]
[null,null,null,"",{"$f":"IF(C85>1.8, 0.5, IF(C85>0.9, 0.45, IF(C85>0.4, 0.4, IF(C85>0.3, 0.35, IF(C85>0.2, 0.3, IF(C85>0.1, 0.25, \"\"))))))","v":""},{"$f":"IF(C85=\"\",\"\",(C85*(E85-((D85-25)*0.002))))","v":""},null,null,"INC",""]
[null,null,null,"","","",null,null,"INC",""]
[null,null,null,"","","",null,null,"INC",""]
[null,null,null,"","","",null,null,"INC",""]
[null,null,null,"","","",null,null,"INC",""]
[null,null,null,"","","",null,null,"INC",""]
[null,null,null,"","","",null,null,"INC",""]
[null,null,null,"","","",null,null,"INC",""]
[null,null,null,"","","",null,null,"INC",""]
[null,null,null,"","","",null,null,"INC",""]
[null,null,null,"","","",null,null,"INC",""]
[null,null,null,"","","",null,null,"INC",""]
[null,null,null,"","","",null,null,"INC",""]
[null,null,null,"","","",null,null,"INC",""]
[null,null,null,"","","",null,null,"INC",""]

{"sheet":"Heaters","index":22,"n_rows":107,"n_cols":13,"rows_kept":107,"cut":false,"hidden":false,"merged":[]}
["Heater Derating Worksheet (reference GSFC Document EEE-INST-002, Section H1, Table 4)",null,null,null,null,null,null,null,null,"CUI//SP-EXPT"]
[]
[null,"Notes:"]
[null,"1) The derating criteria for current or voltage applies to the rated operating current or voltage, not the absolute maximum."]
[]
[]
[null,null,"COMPONENT SPECIFICATION SECTION",null,null,null,null,null,null,null,"DERATING SECTION"]
["Component","Ref. Des.","Operating Rated Current","Operating Rated Voltage","Maximum Rated Temp.","GSFC Derated Operating Current Rqmt","Actual Operating Current","GSFC Derated Operating Voltage Rqmt","Actual Operating Voltage","GSFC Derated Maximum Ambient Temperature Requirement","Actual Ambient Temp","Pass/Fail","REMARKS"]
[null,null,null,null,null,{"$f":"IF(C9<>\"\", C9, \"\")","v":""},null,{"$f":"IF(D9<>\"\", D9, \"\")","v":""},null,{"$f":"IF(E9=\"\",\"\",IF((E9-30)>85,85,(E9-30)))","v":""},null,{"$f":"IF((F9<>\"\")*AND(G9<>\"\")*AND(H9<>\"\")*AND(I9<>\"\")*AND(J9<>\"\")*AND(K9<>\"\"), IF((G9<=F9)*AND(I9<=H9)*AND(K9<=J9),\"PASS\",\"FAIL\"), \"INC\")","v":"INC"}]
[null,null,null,null,null,"",null,"",null,{"$f":"IF(E10=\"\",\"\",IF((E10-30)>85,85,(E10-30)))","v":""},null,"INC"]
[null,null,null,null,null,"",null,"",null,{"$f":"IF(E11=\"\",\"\",IF((E11-30)>85,85,(E11-30)))","v":""},null,"INC"]
[null,null,null,null,null,"",null,"",null,{"$f":"IF(E12=\"\",\"\",IF((E12-30)>85,85,(E12-30)))","v":""},null,"INC"]
[null,null,null,null,null,"",null,"",null,{"$f":"IF(E13=\"\",\"\",IF((E13-30)>85,85,(E13-30)))","v":""},null,"INC"]
[null,null,null,null,null,"",null,"",null,"",null,"INC"]
[null,null,null,null,null,"",null,"",null,"",null,"INC"]
[null,null,null,null,null,"",null,"",null,"",null,"INC"]
[null,null,null,null,null,"",null,"",null,"",null,"INC"]
[null,null,null,null,null,"",null,"",null,"",null,"INC"]
[null,null,null,null,null,"",null,"",null,"",null,"INC"]
[null,null,null,null,null,"",null,"",null,"",null,"INC"]
[null,null,null,null,null,"",null,"",null,"",null,"INC"]
[null,null,null,null,null,{"$f":"IF(C22<>\"\", C22, \"\")","v":""},null,"",null,"",null,"INC"]
[null,null,null,null,null,{"$f":"IF(C23<>\"\", C23, \"\")","v":""},null,"",null,"",null,"INC"]
[null,null,null,null,null,"",null,"",null,"",null,"INC"]
[null,null,null,null,null,"",null,"",null,"",null,"INC"]
[null,null,null,null,null,"",null,"",null,"",null,"INC"]
[null,null,null,null,null,"",null,"",null,"",null,"INC"]
[null,null,null,null,null,"",null,"",null,"",null,"INC"]
[null,null,null,null,null,"",null,"",null,"",null,"INC"]
[null,null,null,null,null,"",null,"",null,"",null,"INC"]
[null,null,null,null,null,"",null,"",null,"",null,"INC"]
[null,null,null,null,null,"",null,"",null,"",null,"INC"]
[null,null,null,null,null,"",null,"",null,"",null,"INC"]
[null,null,null,null,null,"",null,"",null,"",null,"INC"]
[null,null,null,null,null,"",null,"",null,"",null,"INC"]
[null,null,null,null,null,"",null,"",null,"",null,"INC"]
[null,null,null,null,null,"",null,"",null,"",null,"INC"]
[null,null,null,null,null,"",null,"",null,"",null,"INC"]
[null,null,null,null,null,"",null,"",null,"",null,"INC"]
[null,null,null,null,null,"",null,"",null,"",null,"INC"]
[null,null,null,null,null,"",null,"",null,"",null,"INC"]
[null,null,null,null,null,"",null,"",null,"",null,"INC"]
[null,null,null,null,null,"",null,"",null,"",null,"INC"]
[null,null,null,null,null,"",null,"",null,"",null,"INC"]
[null,null,null,null,null,"",null,"",null,"",null,"INC"]
[null,null,null,null,null,"",null,"",null,"",null,"INC"]
[null,null,null,null,null,"",null,"",null,"",null,"INC"]
[null,null,null,null,null,"",null,"",null,"",null,"INC"]
[null,null,null,null,null,"",null,"",null,"",null,"INC"]
[null,null,null,null,null,"",null,"",null,"",null,"INC"]
[null,null,null,null,null,"",null,"",null,"",null,"INC"]
[null,null,null,null,null,"",null,"",null,"",null,"INC"]
[null,null,null,null,null,"",null,"",null,"",null,"INC"]
[null,null,null,null,null,"",null,"",null,"",null,"INC"]
[null,null,null,null,null,"",null,"",null,"",null,"INC"]
[null,null,null,null,null,"",null,"",null,"",null,"INC"]
[null,null,null,null,null,"",null,"",null,"",null,"INC"]
[null,null,null,null,null,"",null,"",null,"",null,"INC"]
[null,null,null,null,null,"",null,"",null,"",null,"INC"]
[null,null,null,null,null,"",null,"",null,"",null,"INC"]
[null,null,null,null,null,"",null,"",null,"",null,"INC"]
[null,null,null,null,null,"",null,"",null,"",null,"INC"]
[null,null,null,null,null,"",null,"",null,"",null,"INC"]
[null,null,null,null,null,"",null,"",null,"",null,"INC"]
[null,null,null,null,null,"",null,"",null,"",null,"INC"]
[null,null,null,null,null,"",null,"",null,"",null,"INC"]
[null,null,null,null,null,"",null,"",null,"",null,"INC"]
[null,null,null,null,null,"",null,"",null,"",null,"INC"]
[null,null,null,null,null,"",null,"",null,"",null,"INC"]
[null,null,null,null,null,"",null,"",null,"",null,"INC"]
[null,null,null,null,null,"",null,"",null,"",null,"INC"]
[null,null,null,null,null,"",null,"",null,"",null,"INC"]
[null,null,null,null,null,"",null,{"$f":"IF(D73<>\"\", D73, \"\")","v":""},null,"",null,{"$f":"IF((F73<>\"\")*AND(G73<>\"\")*AND(H73<>\"\")*AND(I73<>\"\")*AND(J73<>\"\")*AND(K73<>\"\"), IF((G73<=F73)*AND(I73<=H73)*AND(K73<=J73),\"PASS\",\"FAIL\"), \"INC\")","v":"INC"}]
[null,null,null,null,null,"",null,"",null,"",null,"INC"]
[null,null,null,null,null,"",null,"",null,"",null,"INC"]
[null,null,null,null,null,"",null,"",null,"",null,"INC"]
[null,null,null,null,null,"",null,"",null,{"$f":"IF(E77=\"\",\"\",IF((E77-30)>85,85,(E77-30)))","v":""},null,"INC"]
[null,null,null,null,null,"",null,"",null,"",null,"INC"]
[null,null,null,null,null,"",null,"",null,"",null,"INC"]
[null,null,null,null,null,"",null,"",null,"",null,"INC"]
[null,null,null,null,null,"",null,"",null,"",null,"INC"]
[null,null,null,null,null,"",null,"",null,"",null,"INC"]
[null,null,null,null,null,"",null,"",null,"",null,"INC"]
[null,null,null,null,null,"",null,"",null,"",null,"INC"]
[null,null,null,null,null,"",null,"",null,"",null,"INC"]
[null,null,null,null,null,"",null,"",null,"",null,"INC"]
[null,null,null,null,null,{"$f":"IF(C87<>\"\", C87, \"\")","v":""},null,"",null,"",null,"INC"]
[null,null,null,null,null,"",null,"",null,"",null,"INC"]
[null,null,null,null,null,"",null,"",null,"",null,"INC"]
[null,null,null,null,null,"",null,"",null,"",null,"INC"]
[null,null,null,null,null,"",null,"",null,"",null,"INC"]
[null,null,null,null,null,"",null,"",null,"",null,"INC"]
[null,null,null,null,null,"",null,"",null,"",null,"INC"]
[null,null,null,null,null,"",null,"",null,"",null,"INC"]
[null,null,null,null,null,"",null,"",null,"",null,"INC"]
[null,null,null,null,null,"",null,"",null,"",null,"INC"]
[null,null,null,null,null,"",null,"",null,"",null,"INC"]
[null,null,null,null,null,"",null,"",null,"",null,"INC"]
[null,null,null,null,null,"",null,"",null,"",null,"INC"]
[null,null,null,null,null,"",null,"",null,"",null,"INC"]
[null,null,null,null,null,"",null,"",null,"",null,"INC"]
[null,null,null,null,null,"",null,"",null,"",null,"INC"]
[null,null,null,null,null,"",null,"",null,"",null,"INC"]
[null,null,null,null,null,"",null,"",null,"",null,"INC"]
[null,null,null,null,null,"",null,"",null,"",null,"INC"]
[null,null,null,null,null,"",null,"",null,"",null,"INC"]
[null,null,null,null,null,"",null,"",null,"",null,"INC"]

{"sheet":"Thermistors","index":23,"n_rows":105,"n_cols":14,"rows_kept":105,"cut":false,"hidden":false,"merged":[[6,8,6,10]]}
["Thermistor Derating Worksheet (reference GSFC Document EEE-INST-002, Section T1, Table 4)",null,null,null,null,null,null,null,null,"CUI//SP-EXPT"]
[null,null,null,null,null,null,null,null,"PTC"]
["Notes:","1) Derating is applicable to thermistors operating in the self-heating mode. ",null,null,null,null,null,null,"NTC"]
[null,null,null,null,null,null,null,null,null,null,null,null,null,"PTC"]
[null,null,null,"   Select Temperature Coefficient Type First",null,null,null,null,null,null,null,null,null,"NTC"]
[]
[null,null,"COMPONENT SPECIFICATION SECTION",null,null,null,null,null,"Derating Section"]
["Component","Ref. Des.","Temperature Coefficient Type","NTC Thermistor Power Dissipation in W @ 100 °C","NTC Thermistor Maximum Rated Power Dissipation  In W @ 25 °C  ","PTC thermistor Rated Maximum Power","GSFC Derated Power Rqmt","Actual Power","Pass/Fail","REMARKS"]
[null,null,null,null,null,null,{"$f":"IF(C9<>\"\", IF(C9=\"PTC\", IF(F9<>\"\", F9*0.5, \"\"), IF((E9<>\"\")*AND(D9<>\"\"), MIN(E9*0.02, D9), \"\")), \"\")","v":""},null,{"$f":"IF((G9<>\"\")*AND(H9<>\"\"), IF((H9<=G9),\"PASS\",\"FAIL\"), \"INC\")","v":"INC"}]
[null,null,null,null,null,null,"",null,"INC"]
[null,null,null,null,null,null,"",null,"INC"]
[null,null,null,null,null,null,"",null,"INC"]
[null,null,null,null,null,null,"",null,"INC"]
[null,null,null,null,null,null,"",null,"INC"]
[null,null,null,null,null,null,"",null,"INC"]
[null,null,null,null,null,null,"",null,"INC"]
[null,null,null,null,null,null,"",null,"INC"]
[null,null,null,null,null,null,"",null,"INC"]
[null,null,null,null,null,null,"",null,"INC"]
[null,null,null,null,null,null,"",null,"INC"]
[null,null,null,null,null,null,"",null,"INC"]
[null,null,null,null,null,null,"",null,"INC"]
[null,null,null,null,null,null,"",null,"INC"]
[null,null,null,null,null,null,"",null,"INC"]
[null,null,null,null,null,null,"",null,"INC"]
[null,null,null,null,null,null,"",null,"INC"]
[null,null,null,null,null,null,"",null,"INC"]
[null,null,null,null,null,null,"",null,"INC"]
[null,null,null,null,null,null,"",null,"INC"]
[null,null,null,null,null,null,"",null,"INC"]
[null,null,null,null,null,null,"",null,"INC"]
[null,null,null,null,null,null,"",null,"INC"]
[null,null,null,null,null,null,"",null,"INC"]
[null,null,null,null,null,null,"",null,"INC"]
[null,null,null,null,null,null,"",null,"INC"]
[null,null,null,null,null,null,"",null,"INC"]
[null,null,null,null,null,null,"",null,"INC"]
[null,null,null,null,null,null,"",null,"INC"]
[null,null,null,null,null,null,"",null,"INC"]
[null,null,null,null,null,null,"",null,"INC"]
[null,null,null,null,null,null,"",null,"INC"]
[null,null,null,null,null,null,"",null,"INC"]
[null,null,null,null,null,null,"",null,"INC"]
[null,null,null,null,null,null,"",null,"INC"]
[null,null,null,null,null,null,"",null,"INC"]
[null,null,null,null,null,null,"",null,"INC"]
[null,null,null,null,null,null,"",null,"INC"]
[null,null,null,null,null,null,"",null,"INC"]
[null,null,null,null,null,null,"",null,"INC"]
[null,null,null,null,null,null,"",null,"INC"]
[null,null,null,null,null,null,"",null,"INC"]
[null,null,null,null,null,null,"",null,"INC"]
[null,null,null,null,null,null,"",null,"INC"]
[null,null,null,null,null,null,"",null,"INC"]
[null,null,null,null,null,null,"",null,"INC"]
[null,null,null,null,null,null,"",null,"INC"]
[null,null,null,null,null,null,"",null,"INC"]
[null,null,null,null,null,null,"",null,"INC"]
[null,null,null,null,null,null,"",null,"INC"]
[null,null,null,null,null,null,"",null,"INC"]
[null,null,null,null,null,null,"",null,"INC"]
[null,null,null,null,null,null,"",null,"INC"]
[null,null,null,null,null,null,"",null,"INC"]
[null,null,null,null,null,null,"",null,"INC"]
[null,null,null,null,null,null,"",null,"INC"]
[null,null,null,null,null,null,"",null,"INC"]
[null,null,null,null,null,null,"",null,"INC"]
[null,null,null,null,null,null,"",null,"INC"]
[null,null,null,null,null,null,"",null,"INC"]
[null,null,null,null,null,null,"",null,"INC"]
[null,null,null,null,null,null,"",null,"INC"]
[null,null,null,null,null,null,"",null,"INC"]
[null,null,null,null,null,null,{"$f":"IF(C73<>\"\", IF(C73=\"PTC\", IF(F73<>\"\", F73*0.5, \"\"), IF((E73<>\"\")*AND(D73<>\"\"), MIN(E73*0.02, D73), \"\")), \"\")","v":""},null,{"$f":"IF((G73<>\"\")*AND(H73<>\"\"), IF((H73<=G73),\"PASS\",\"FAIL\"), \"INC\")","v":"INC"}]
[null,null,null,null,null,null,"",null,"INC"]
[null,null,null,null,null,null,"",null,"INC"]
[null,null,null,null,null,null,"",null,"INC"]
[null,null,null,null,null,null,"",null,"INC"]
[null,null,null,null,null,null,"",null,"INC"]
[null,null,null,null,null,null,"",null,"INC"]
[null,null,null,null,null,null,"",null,"INC"]
[null,null,null,null,null,null,"",null,"INC"]
[null,null,null,null,null,null,"",null,"INC"]
[null,null,null,null,null,null,"",null,"INC"]
[null,null,null,null,null,null,"",null,"INC"]
[null,null,null,null,null,null,"",null,"INC"]
[null,null,null,null,null,null,"",null,"INC"]
[null,null,null,null,null,null,"",null,"INC"]
[null,null,null,null,null,null,"",null,"INC"]
[null,null,null,null,null,null,"",null,"INC"]
[null,null,null,null,null,null,"",null,"INC"]
[null,null,null,null,null,null,"",null,"INC"]
[null,null,null,null,null,null,"",null,"INC"]
[null,null,null,null,null,null,"",null,"INC"]
[null,null,null,null,null,null,"",null,"INC"]
[null,null,null,null,null,null,"",null,"INC"]
[null,null,null,null,null,null,"",null,"INC"]
[null,null,null,null,null,null,"",null,"INC"]
[null,null,null,null,null,null,"",null,"INC"]
[null,null,null,null,null,null,"",null,"INC"]
[null,null,null,null,null,null,"",null,"INC"]
[null,null,null,null,null,null,"",null,"INC"]
[null,null,null,null,null,null,"",null,"INC"]
[null,null,null,null,null,null,"",null,"INC"]
[null,null,null,null,null,null,"",null,"INC"]
[null,null,null,null,null,null,"",null,"INC"]

{"sheet":"Crystal","index":24,"n_rows":108,"n_cols":10,"rows_kept":108,"cut":false,"hidden":false,"merged":[[7,7,7,8]]}
["Crystal Derating Worksheet (reference GSFC Document EEE-INST-002, Section C3, Table 4)",null,null,null,null,null,null,null,null,"CUI//SP-EXPT"]
[]
[null,"Notes:"]
[null,"1) Choose either maximum current or maximum power to derate, but do not derate both. These deratings  "]
[null,"    (current to 0.5,and power to 0.25) apply over the manufacturer's recommended operating temperature."]
[]
[]
[null,null,"COMPONENT SPECIFICATION SECTION",null,null,null,null,"DERATING SECTION"]
["Component","Ref. Des.","Maximum Current, Rated","Maximum Power, Rated","GSFC Derated Current Requirement","Actual Current","GSFC Derated Power Requirement","Actual Power","Pass/Fail","REMARKS"]
[null,null,null,null,{"$f":"IF((C10<>\"\"),0.5*C10,\"\")","v":""},null,{"$f":"IF((D10<>\"\"),0.25*D10,\"\")","v":""},null,{"$f":"IF((E10<>\"\")*AND(F10<>\"\")*AND(G10<>\"\")*AND(H10<>\"\"), IF((F10<=E10)*AND(H10<=G10),\"PASS\",\"FAIL\"), \"INC\")","v":"INC"}]
[null,null,null,null,"",null,"",null,"INC"]
[null,null,null,null,"",null,"",null,"INC"]
[null,null,null,null,"",null,"",null,"INC"]
[null,null,null,null,"",null,"",null,"INC"]
[null,null,null,null,"",null,"",null,"INC"]
[null,null,null,null,"",null,"",null,"INC"]
[null,null,null,null,"",null,"",null,"INC"]
[null,null,null,null,"",null,"",null,"INC"]
[null,null,null,null,"",null,"",null,"INC"]
[null,null,null,null,"",null,"",null,"INC"]
[null,null,null,null,"",null,"",null,"INC"]
[null,null,null,null,"",null,"",null,"INC"]
[null,null,null,null,"",null,"",null,"INC"]
[null,null,null,null,"",null,"",null,"INC"]
[null,null,null,null,"",null,"",null,"INC"]
[null,null,null,null,"",null,"",null,"INC"]
[null,null,null,null,"",null,"",null,"INC"]
[null,null,null,null,"",null,"",null,"INC"]
[null,null,null,null,"",null,"",null,"INC"]
[null,null,null,null,"",null,"",null,"INC"]
[null,null,null,null,"",null,"",null,"INC"]
[null,null,null,null,"",null,"",null,"INC"]
[null,null,null,null,"",null,"",null,"INC"]
[null,null,null,null,"",null,"",null,"INC"]
[null,null,null,null,"",null,"",null,"INC"]
[null,null,null,null,"",null,"",null,"INC"]
[null,null,null,null,"",null,"",null,"INC"]
[null,null,null,null,"",null,"",null,"INC"]
[null,null,null,null,"",null,"",null,"INC"]
[null,null,null,null,"",null,"",null,"INC"]
[null,null,null,null,"",null,"",null,"INC"]
[null,null,null,null,"",null,"",null,"INC"]
[null,null,null,null,"",null,"",null,"INC"]
[null,null,null,null,"",null,"",null,"INC"]
[null,null,null,null,"",null,"",null,"INC"]
[null,null,null,null,"",null,"",null,"INC"]
[null,null,null,null,"",null,"",null,"INC"]
[null,null,null,null,"",null,"",null,"INC"]
[null,null,null,null,"",null,"",null,"INC"]
[null,null,null,null,"",null,"",null,"INC"]
[null,null,null,null,"",null,"",null,"INC"]
[null,null,null,null,"",null,"",null,"INC"]
[null,null,null,null,"",null,"",null,"INC"]
[null,null,null,null,"",null,"",null,"INC"]
[null,null,null,null,"",null,"",null,"INC"]
[null,null,null,null,"",null,"",null,"INC"]
[null,null,null,null,"",null,"",null,"INC"]
[null,null,null,null,"",null,"",null,"INC"]
[null,null,null,null,"",null,"",null,"INC"]
[null,null,null,null,"",null,"",null,"INC"]
[null,null,null,null,"",null,"",null,"INC"]
[null,null,null,null,"",null,"",null,"INC"]
[null,null,null,null,"",null,"",null,"INC"]
[null,null,null,null,"",null,"",null,"INC"]
[null,null,null,null,"",null,"",null,"INC"]
[null,null,null,null,"",null,"",null,"INC"]
[null,null,null,null,"",null,"",null,"INC"]
[null,null,null,null,"",null,"",null,"INC"]
[null,null,null,null,"",null,"",null,"INC"]
[null,null,null,null,"",null,"",null,"INC"]
[null,null,null,null,"",null,"",null,"INC"]
[null,null,null,null,"",null,"",null,"INC"]
[null,null,null,null,"",null,"",null,"INC"]
[null,null,null,null,{"$f":"IF((C74<>\"\"),0.5*C74,\"\")","v":""},null,{"$f":"IF((D74<>\"\"),0.25*D74,\"\")","v":""},null,{"$f":"IF((E74<>\"\")*AND(F74<>\"\")*AND(G74<>\"\")*AND(H74<>\"\"), IF((F74<=E74)*AND(H74<=G74),\"PASS\",\"FAIL\"), \"INC\")","v":"INC"}]
[null,null,null,null,"",null,"",null,"INC"]
[null,null,null,null,"",null,"",null,"INC"]
[null,null,null,null,"",null,"",null,"INC"]
[null,null,null,null,"",null,"",null,"INC"]
[null,null,null,null,"",null,"",null,"INC"]
[null,null,null,null,"",null,"",null,"INC"]
[null,null,null,null,"",null,"",null,"INC"]
[null,null,null,null,"",null,"",null,"INC"]
[null,null,null,null,"",null,"",null,"INC"]
[null,null,null,null,"",null,"",null,"INC"]
[null,null,null,null,"",null,"",null,"INC"]
[null,null,null,null,"",null,"",null,"INC"]
[null,null,null,null,"",null,"",null,"INC"]
[null,null,null,null,"",null,"",null,"INC"]
[null,null,null,null,"",null,"",null,"INC"]
[null,null,null,null,"",null,"",null,"INC"]
[null,null,null,null,"",null,"",null,"INC"]
[null,null,null,null,"",null,"",null,"INC"]
[null,null,null,null,"",null,"",null,"INC"]
[null,null,null,null,"",null,"",null,"INC"]
[null,null,null,null,"",null,"",null,"INC"]
[null,null,null,null,"",null,"",null,"INC"]
[null,null,null,null,"",null,"",null,"INC"]
[null,null,null,null,"",null,"",null,"INC"]
[null,null,null,null,"",null,"",null,"INC"]
[null,null,null,null,"",null,"",null,"INC"]
[null,null,null,null,"",null,"",null,"INC"]
[null,null,null,null,"",null,"",null,"INC"]
[null,null,null,null,"",null,"",null,"INC"]
[null,null,null,null,"",null,"",null,"INC"]
[null,null,null,null,"",null,"",null,"INC"]
[null,null,null,null,"",null,"",null,"INC"]
[null,null,null,null,"",null,"",null,"INC"]
[null,null,null,null,"",null,"",null,"INC"]

{"sheet":"Relays","index":25,"n_rows":111,"n_cols":21,"rows_kept":111,"cut":false,"hidden":false,"merged":[[11,11,11,12]]}
["Relay Derating Worksheet (reference GSFC Document EEE-INST-002, Section R1, Table 4)",null,null,null,null,null,null,null,null,"CUI//SP-EXPT"]
[]
["Notes:"]
["1) Warning Do not derate coil voltage or current. Operating a relay at less than nominal coil rating can result in either switching failures or increased switching times. ",null,null,null,null,null,null,null,null,null,null,null,null,null,null,null,null,1.5,0.9,0.9,"Yes"]
["   The latter condition induces contact damage because of the longer arcing time, thus reducing relay reliability.",null,null,null,null,null,null,null,null,null,null,null,null,null,null,null,null,1,0.85,0.85,"No"]
["2) Select the appropriate factors for T, R & L from the subtables:     I derated = I rated x T x R x L,    where:  I derated = derated contact current carrying capacity",null,null,null,null,null,null,null,null,null,null,null,"I rated = rated contact current",null,null,null,null,0.8,null,0.7]
["3) If during switching, transient current surges exceed the derated contact current, the following applies, where:"]
[null,null,null,null,null,null,null,"t = period of time that transient current exceeds rated contact current (I rated)"]
[null,"For t =< 10 μs,  I max =< 4 x I rated",null,null,null,null,null,"I max = maximum permitted surge current"]
[null,"For t > 10 μs,  (I max )^2 X t =< 16 X (I rated )^2 X 1.e-5",null,null,null,null,null,"I rated = rated contact current"]
[]
[null,null,"COMPONENT SPECIFICATION SECTION",null,null,null,null,null,null,null,null,"DERATING SECTION"]
["Component","Ref. Des.","Rated Load Current, (Resistive load.)","Actual Lowest Operating Temp. °C","Actual Highest Operating Temp. °C","Actual Operating Load Current","t (See Note 3) Duration in μs  Transient current exceeds I rated ","I max Maximum Permitted Surge Current","Temp. Derating Factor","Load Application Derating Factor","Cycles Derating Factor ","GSFC Derated Operating Load Current","Meets Transient Derating (see note 3 above for criteria)","Pass/Fail","REMARKS"]
[null,null,null,null,null,null,null,null,null,null,null,null,null,{"$f":"IF((F14<>\"\")*AND(L14<>\"\")*AND(M14<>\"\"), IF((F14<=L14)*AND(M14=\"Yes\"),\"PASS\",\"FAIL\"), \"INC\")","v":"INC"}]
[null,null,null,null,null,null,null,null,null,null,null,{"$f":"IF((C15<>\"\")*AND(I15<>\"\")*AND(J15<>\"\")*AND(K15<>\"\"), C15*I15*J15*K15, \"\")","v":""},{"$f":"IF((C15<>\"\")*AND(G15<>\"\")*AND(H15<>\"\"), IF(G15<=10, IF(H15<=4*C15, \"Yes\", \"No\"), IF(G15*H15^2<=160*C15^2, \"Yes\", \"No\")), \"\")","v":""},{"$f":"IF((F15<>\"\")*AND(L15<>\"\")*AND(M15<>\"\"), IF((F15<=L15)*AND(M15=\"Yes\"),\"PASS\",\"FAIL\"), \"INC\")","v":"INC"}]
[null,null,null,null,null,null,null,null,null,null,null,"","","INC"]
[null,null,null,null,null,null,null,null,null,null,null,"","","INC"]
[null,null,null,null,null,null,null,null,null,null,null,"","","INC"]
[null,null,null,null,null,null,null,null,null,null,null,"","","INC"]
[null,null,null,null,null,null,null,null,null,null,null,"","","INC"]
[null,null,null,null,null,null,null,null,null,null,null,"","","INC"]
[null,null,null,null,null,null,null,null,null,null,null,"","","INC"]
[null,null,null,null,null,null,null,null,null,null,null,"","","INC"]
[null,null,null,null,null,null,null,null,null,null,null,"","","INC"]
[null,null,null,null,null,null,null,null,null,null,null,"","","INC"]
[null,null,null,null,null,null,null,null,null,null,null,"","","INC"]
[null,null,null,null,null,null,null,null,null,null,null,"","","INC"]
[null,null,null,null,null,null,null,null,null,null,null,"","","INC"]
[null,null,null,null,null,null,null,null,null,null,null,"","","INC"]
[null,null,null,null,null,null,null,null,null,null,null,"","","INC"]
[null,null,null,null,null,null,null,null,null,null,null,"","","INC"]
[null,null,null,null,null,null,null,null,null,null,null,"","","INC"]
[null,null,null,null,null,null,null,null,null,null,null,"","","INC"]
[null,null,null,null,null,null,null,null,null,null,null,"","","INC"]
[null,null,null,null,null,null,null,null,null,null,null,"","","INC"]
[null,null,null,null,null,null,null,null,null,null,null,"","","INC"]
[null,null,null,null,null,null,null,null,null,null,null,"","","INC"]
[null,null,null,null,null,null,null,null,null,null,null,"","","INC"]
[null,null,null,null,null,null,null,null,null,null,null,"","","INC"]
[null,null,null,null,null,null,null,null,null,null,null,"","","INC"]
[null,null,null,null,null,null,null,null,null,null,null,"","","INC"]
[null,null,null,null,null,null,null,null,null,null,null,"","","INC"]
[null,null,null,null,null,null,null,null,null,null,null,"","","INC"]
[null,null,null,null,null,null,null,null,null,null,null,"","","INC"]
[null,null,null,null,null,null,null,null,null,null,null,"","","INC"]
[null,null,null,null,null,null,null,null,null,null,null,"","","INC"]
[null,null,null,null,null,null,null,null,null,null,null,"","","INC"]
[null,null,null,null,null,null,null,null,null,null,null,"","","INC"]
[null,null,null,null,null,null,null,null,null,null,null,"","","INC"]
[null,null,null,null,null,null,null,null,null,null,null,"","","INC"]
[null,null,null,null,null,null,null,null,null,null,null,"","","INC"]
[null,null,null,null,null,null,null,null,null,null,null,"","","INC"]
[null,null,null,null,null,null,null,null,null,null,null,"","","INC"]
[null,null,null,null,null,null,null,null,null,null,null,"","","INC"]
[null,null,null,null,null,null,null,null,null,null,null,"","","INC"]
[null,null,null,null,null,null,null,null,null,null,null,"","","INC"]
[null,null,null,null,null,null,null,null,null,null,null,"","","INC"]
[null,null,null,null,null,null,null,null,null,null,null,"","","INC"]
[null,null,null,null,null,null,null,null,null,null,null,"","","INC"]
[null,null,null,null,null,null,null,null,null,null,null,"","","INC"]
[null,null,null,null,null,null,null,null,null,null,null,"","","INC"]
[null,null,null,null,null,null,null,null,null,null,null,"","","INC"]
[null,null,null,null,null,null,null,null,null,null,null,"","","INC"]
[null,null,null,null,null,null,null,null,null,null,null,"","","INC"]
[null,null,null,null,null,null,null,null,null,null,null,"","","INC"]
[null,null,null,null,null,null,null,null,null,null,null,"","","INC"]
[null,null,null,null,null,null,null,null,null,null,null,"","","INC"]
[null,null,null,null,null,null,null,null,null,null,null,"","","INC"]
[null,null,null,null,null,null,null,null,null,null,null,"","","INC"]
[null,null,null,null,null,null,null,null,null,null,null,"","","INC"]
[null,null,null,null,null,null,null,null,null,null,null,"","","INC"]
[null,null,null,null,null,null,null,null,null,null,null,"","","INC"]
[null,null,null,null,null,null,null,null,null,null,null,"","","INC"]
[null,null,null,null,null,null,null,null,null,null,null,"","","INC"]
[null,null,null,null,null,null,null,null,null,null,null,"","","INC"]
[null,null,null,null,null,null,null,null,null,null,null,"","","INC"]
[null,null,null,null,null,null,null,null,null,null,null,"","","INC"]
[null,null,null,null,null,null,null,null,null,null,null,"","","INC"]
[null,null,null,null,null,null,null,null,null,null,null,{"$f":"IF((C79<>\"\")*AND(I79<>\"\")*AND(J79<>\"\")*AND(K79<>\"\"), C79*I79*J79*K79, \"\")","v":""},{"$f":"IF((C79<>\"\")*AND(G79<>\"\")*AND(H79<>\"\"), IF(G79<=10, IF(H79<=4*C79, \"Yes\", \"No\"), IF(G79*H79^2<=160*C79^2, \"Yes\", \"No\")), \"\")","v":""},{"$f":"IF((F79<>\"\")*AND(L79<>\"\")*AND(M79<>\"\"), IF((F79<=L79)*AND(M79=\"Yes\"),\"PASS\",\"FAIL\"), \"INC\")","v":"INC"}]
[null,null,null,null,null,null,null,null,null,null,null,"","","INC"]
[null,null,null,null,null,null,null,null,null,null,null,"","","INC"]
[null,null,null,null,null,null,null,null,null,null,null,"","","INC"]
[null,null,null,null,null,null,null,null,null,null,null,"","","INC"]
[null,null,null,null,null,null,null,null,null,null,null,"","","INC"]
[null,null,null,null,null,null,null,null,null,null,null,"","","INC"]
[null,null,null,null,null,null,null,null,null,null,null,"","","INC"]
[null,null,null,null,null,null,null,null,null,null,null,"","","INC"]
[null,null,null,null,null,null,null,null,null,null,null,"","","INC"]
[null,null,null,null,null,null,null,null,null,null,null,"","","INC"]
[null,null,null,null,null,null,null,null,null,null,null,"","","INC"]
[null,null,null,null,null,null,null,null,null,null,null,"","","INC"]
[null,null,null,null,null,null,null,null,null,null,null,"","","INC"]
[null,null,null,null,null,null,null,null,null,null,null,"","","INC"]
[null,null,null,null,null,null,null,null,null,null,null,"","","INC"]
[null,null,null,null,null,null,null,null,null,null,null,"","","INC"]
[null,null,null,null,null,null,null,null,null,null,null,"","","INC"]
[null,null,null,null,null,null,null,null,null,null,null,"","","INC"]
[null,null,null,null,null,null,null,null,null,null,null,"","","INC"]
[null,null,null,null,null,null,null,null,null,null,null,"","","INC"]
[null,null,null,null,null,null,null,null,null,null,null,"","","INC"]
[null,null,null,null,null,null,null,null,null,null,null,"","","INC"]
[null,null,null,null,null,null,null,null,null,null,null,"","","INC"]
[null,null,null,null,null,null,null,null,null,null,null,"","","INC"]
[null,null,null,null,null,null,null,null,null,null,null,"","","INC"]
[null,null,null,null,null,null,null,null,null,null,null,"","","INC"]
[null,null,null,null,null,null,null,null,null,null,null,"","","INC"]
[null,null,null,null,null,null,null,null,null,null,null,"","","INC"]
[null,null,null,null,null,null,null,null,null,null,null,"","","INC"]
[null,null,null,null,null,null,null,null,null,null,null,"","","INC"]
[null,null,null,null,null,null,null,null,null,null,null,{"$f":"IF((C110<>\"\")*AND(I110<>\"\")*AND(J110<>\"\")*AND(K110<>\"\"), C110*I110*J110*K110, \"\")","v":""},"","INC"]
[null,null,null,null,null,null,null,null,null,null,null,{"$f":"IF((C111<>\"\")*AND(I111<>\"\")*AND(J111<>\"\")*AND(K111<>\"\"), C111*I111*J111*K111, \"\")","v":""},"","INC"]

{"sheet":"Switches","index":26,"n_rows":38,"n_cols":15,"rows_kept":38,"cut":false,"hidden":false,"merged":[]}
["Switch Derating Worksheet (reference GSFC Document EEE-INST-002, Section S2, Table 4)",null,null,null,null,null,null,null,null,"CUI//SP-EXPT"]
[]
[null,"Notes:"]
[null,"1) Applies mainly to switches that are rated with a resistive load current rating only."]
[null,"2) Temperature derating is not applicable to thermostatic switches."]
[]
["   Derating Table",null,"    Select  Switch Type, Load Type and Ambient Temperature First"]
[]
[null,null,"COMPONENT SPECIFICATION SECTION",null,null,null,null,null,null,"DERATING SECTION"]
["Component","Ref. Des.","Switch Type (Military or Commercial)","Load Type (Resistive, Inductive & Motor, Capacitative & Lamp)","Ambient Temp (°C) \n(0-85°C, > 85°C)","Maximum Load Current, Rated","Resistive / Inductive / Capacitative Load Derating Factor","GSFC Derated Load Current Rqmt","Actual Load Current","Pass/Fail",null,null,"REMARKS"]
[null,null,null,null,null,null,{"$f":"IF(C11=\"\",\"\", IF(C11=\"Commercial\", IF(E11=\"0 - 85\", K11, IF(E11=\"> 85\", L11, \"\")), IF(E11=\"\", \"\", IF(E11=\"0 - 85\", 0.75, 0.6))))","v":""},{"$f":"IF((G11<>\"\")*AND(F11<>\"\"), G11*F11, \"\")","v":""},null,{"$f":"IF((H11<>\"\")*AND(I11<>\"\"), IF((I11<=H11),\"PASS\",\"FAIL\"), \"INC\")","v":"INC"},{"$f":"IF(D11=\"Resistive\", 0.75, IF(D11=\"Inductive & Motor\", 0.4, IF(D11=\"Capacitive & Lamp\", 0.25, \"\")))","v":""},{"$f":"IF(D11=\"Resistive\", 0.6, IF(D11=\"Inductive & Motor\", 0.3, IF(D11=\"Capacitive & Lamp\", 0.2, \"\")))","v":""}]
[null,null,null,null,null,null,"","",null,"INC","","",null,null,"Ambient Temp"]
[null,null,null,null,null,null,{"$f":"IF(C13=\"\",\"\", IF(C13=\"Commercial\", IF(E13=\"0 - 85\", K13, IF(E13=\"> 85\", L13, \"\")), IF(E13=\"\", \"\", IF(E13=\"0 - 85\", 0.75, 0.6))))","v":""},{"$f":"IF((G13<>\"\")*AND(F13<>\"\"), G13*F13, \"\")","v":""},null,{"$f":"IF((H13<>\"\")*AND(I13<>\"\"), IF((I13<=H13),\"PASS\",\"FAIL\"), \"INC\")","v":"INC"},{"$f":"IF(D13=\"Resistive\", 0.75, IF(D13=\"Inductive & Motor\", 0.4, IF(D13=\"Capacitive & Lamp\", 0.25, \"\")))","v":""},{"$f":"IF(D13=\"Resistive\", 0.6, IF(D13=\"Inductive & Motor\", 0.3, IF(D13=\"Capacitive & Lamp\", 0.2, \"\")))","v":""},null,null,"0 - 85"]
[null,null,null,null,null,null,{"$f":"IF(C14=\"\",\"\", IF(C14=\"Commercial\", IF(E14=\"0 - 85\", K14, IF(E14=\"> 85\", L14, \"\")), IF(E14=\"\", \"\", IF(E14=\"0 - 85\", 0.75, 0.6))))","v":""},{"$f":"IF((G14<>\"\")*AND(F14<>\"\"), G14*F14, \"\")","v":""},null,{"$f":"IF((H14<>\"\")*AND(I14<>\"\"), IF((I14<=H14),\"PASS\",\"FAIL\"), \"INC\")","v":"INC"},{"$f":"IF(D14=\"Resistive\", 0.75, IF(D14=\"Inductive & Motor\", 0.4, IF(D14=\"Capacitive & Lamp\", 0.25, \"\")))","v":""},{"$f":"IF(D14=\"Resistive\", 0.6, IF(D14=\"Inductive & Motor\", 0.3, IF(D14=\"Capacitive & Lamp\", 0.2, \"\")))","v":""},null,null,"> 85"]
[null,null,null,null,null,null,{"$f":"IF(C15=\"\",\"\", IF(C15=\"Commercial\", IF(E15=\"0 - 85\", K15, IF(E15=\"> 85\", L15, \"\")), IF(E15=\"\", \"\", IF(E15=\"0 - 85\", 0.75, 0.6))))","v":""},{"$f":"IF((G15<>\"\")*AND(F15<>\"\"), G15*F15, \"\")","v":""},null,{"$f":"IF((H15<>\"\")*AND(I15<>\"\"), IF((I15<=H15),\"PASS\",\"FAIL\"), \"INC\")","v":"INC"},{"$f":"IF(D15=\"Resistive\", 0.75, IF(D15=\"Inductive & Motor\", 0.4, IF(D15=\"Capacitive & Lamp\", 0.25, \"\")))","v":""},{"$f":"IF(D15=\"Resistive\", 0.6, IF(D15=\"Inductive & Motor\", 0.3, IF(D15=\"Capacitive & Lamp\", 0.2, \"\")))","v":""}]
[null,null,null,null,null,null,"","",null,"INC","","",null,null,"0 - 85"]
[null,null,null,null,null,null,"","",null,"INC","","",null,null,"> 85"]
[null,null,null,null,null,null,"","",null,"INC","",""]
[null,null,null,null,null,null,"","",null,"INC","","",null,null,"Load Type"]
[null,null,null,null,null,null,"","",null,"INC","","",null,null,"Resistive"]
[null,null,null,null,null,null,"","",null,"INC","","",null,null,"Inductive & Motor"]
[null,null,null,null,null,null,"","",null,"INC","","",null,null,"Capacitive & Lamp"]
[null,null,null,null,null,null,"","",null,"INC","",""]
[null,null,null,null,null,null,"","",null,"INC","","",null,null,"Switch Type"]
[null,null,null,null,null,null,"","",null,"INC","","",null,null,"Military"]
[null,null,null,null,null,null,"","",null,"INC","","",null,null,"Commercial"]
[null,null,null,null,null,null,"","",null,"INC","",""]
[null,null,null,null,null,null,"","",null,"INC","",""]
[null,null,null,null,null,null,"","",null,"INC","",""]
[null,null,null,null,null,null,"","",null,"INC","",""]
[null,null,null,null,null,null,"","",null,"INC","",""]
[null,null,null,null,null,null,"","",null,"INC","",""]
[null,null,null,null,null,null,"","",null,"INC","",""]
[null,null,null,null,null,null,"","",null,"INC","",""]
[null,null,null,null,null,null,"","",null,"INC","",""]
[null,null,null,null,null,null,"","",null,"INC","",""]
[null,null,null,null,null,null,"","",null,"INC","",""]
[null,null,null,null,null,null,"","",null,"INC","",""]

{"sheet":"Wire & Cable","index":27,"n_rows":511,"n_cols":16,"rows_kept":511,"cut":false,"hidden":false,"merged":[[11,8,11,10]]}
["Wire & Cable Derating Worksheet (reference GSFC Document EEE-INST-002, Section W1, Table 4A)",null,null,null,null,null,null,null,null,"CUI//SP-EXPT"]
[]
["Notes:","1) Derated current ratings are based on an ambient temperature of 70 °C or less in a hard vacuum of 10 ^ -6 torr. For derating above "]
[null,"    70 °C ambient, consult project parts engineer.",null,null,null,null,null,null,null,null,null,null,null,135,0.7]
[null,"2) The derated current ratings are for 200 °C rated wire, such as TeflonTM insulated (Type PTFE) wire, in a hard vacuum of 1*10 ^ -6 torr. ",null,null,null,null,null,null,null,null,null,null,null,150,0.8]
[null,"    ","a. For 150 °C wire, use 80% of derated current requirement.",null,null,null,null,null,null,null,null,null,null,200,1]
[null,null,"b. For 135 °C wire, use 70% of derated current requirement.",null,null,null,null,null,null,null,null,null,null,260,1.1499999999999999]
[null,null,"b. For 260 °C wire, 115% of derated current requirement can be used."]
[null,null,null,null,null,null,null,null,null,null,null,null,null,null,"Single"]
[null,null,null,null,"     Select Wire Type First",null,null,null,null,null,null,null,null,null,"Bundled & Cable"]
[]
[null,null,"COMPONENT SPECIFICATION SECTION",null,null,null,null,null,"DERATING SECTION"]
["Component","Ref. Des.","Wire Type","Wire Size (AWG)","Wire Temp. Rating in °C","Wire Temperature Derating","GSFC Derated Current Requirement","Actual Current","Pass/Fail","REMARKS"]
[null,null,null,null,null,{"$f":"IF(E14<>\"\",VLOOKUP(E14,$N$4:$O$7,2),\"\")","v":""},{"$f":"IF(E14<>\"\", IF((D14<>\"\")*AND(C14<>\"\"), IF(C14=\"Single\", VLOOKUP(D14, $L$16:$M$31, 2)*F14, VLOOKUP(D14,$O$16:$P$31,2)*F14), \"\"), \"\")","v":""},null,{"$f":"IF((G14<>\"\")*AND(H14<>\"\"), IF(H14<=G14,\"PASS\",\"FAIL\"), \"INC\")","v":"INC"}]
[null,null,null,null,null,"","",null,"INC"]
[null,null,null,null,null,"","",null,"INC",null,null,0,147,null,0,75]
[null,null,null,null,null,"","",null,"INC",null,null,2,108,null,2,50]
[null,null,null,null,null,"","",null,"INC",null,null,4,81,null,4,40]
[null,null,null,null,null,"","",null,"INC",null,null,6,60,null,6,30]
[null,null,null,null,null,"","",null,"INC",null,null,8,44,null,8,23]
[null,null,null,null,null,"","",null,"INC",null,null,10,33,null,10,16.5]
[null,null,null,null,null,"","",null,"INC",null,null,12,25,null,12,11.5]
[null,null,null,null,null,"","",null,"INC",null,null,14,19,null,14,8.5]
[null,null,null,null,null,"","",null,"INC",null,null,16,13,null,16,6.5]
[null,null,null,null,null,"","",null,"INC",null,null,18,9.1999999999999993,null,18,5]
[null,null,null,null,null,"","",null,"INC",null,null,20,6.5,null,20,3.7]
[null,null,null,null,null,"","",null,"INC",null,null,22,4.5,null,22,2.5]
[null,null,null,null,null,"","",null,"INC",null,null,24,3.3,null,24,2]
[null,null,null,null,null,"","",null,"INC",null,null,26,2.5,null,26,1.4]
[null,null,null,null,null,"","",null,"INC",null,null,28,1.8,null,28,1]
[null,null,null,null,null,"","",null,"INC",null,null,30,1.3,null,30,0.7]
[null,null,null,null,null,"","",null,"INC"]
[null,null,null,null,null,"","",null,"INC"]
[null,null,null,null,null,"","",null,"INC"]
[null,null,null,null,null,"","",null,"INC"]
[null,null,null,null,null,"","",null,"INC"]
[null,null,null,null,null,"","",null,"INC"]
[null,null,null,null,null,"","",null,"INC"]
[null,null,null,null,null,"","",null,"INC"]
[null,null,null,null,null,"","",null,"INC"]
[null,null,null,null,null,"","",null,"INC"]
[null,null,null,null,null,"","",null,"INC"]
[null,null,null,null,null,"","",null,"INC"]
[null,null,null,null,null,"","",null,"INC"]
[null,null,null,null,null,"","",null,"INC"]
[null,null,null,null,null,"","",null,"INC"]
[null,null,null,null,null,"","",null,"INC"]
[null,null,null,null,null,"","",null,"INC"]
[null,null,null,null,null,"","",null,"INC"]
[null,null,null,null,null,"","",null,"INC"]
[null,null,null,null,null,"","",null,"INC"]
[null,null,null,null,null,"","",null,"INC"]
[null,null,null,null,null,"","",null,"INC"]
[null,null,null,null,null,"","",null,"INC"]
[null,null,null,null,null,"","",null,"INC"]
[null,null,null,null,null,"","",null,"INC"]
[null,null,null,null,null,"","",null,"INC"]
[null,null,null,null,null,"","",null,"INC"]
[null,null,null,null,null,"","",null,"INC"]
[null,null,null,null,null,"","",null,"INC"]
[null,null,null,null,null,"","",null,"INC"]
[null,null,null,null,null,"","",null,"INC"]
[null,null,null,null,null,"","",null,"INC"]
[null,null,null,null,null,"","",null,"INC"]
[null,null,null,null,null,"","",null,"INC"]
[null,null,null,null,null,"","",null,"INC"]
[null,null,null,null,null,"","",null,"INC"]
[null,null,null,null,null,"","",null,"INC"]
[null,null,null,null,null,"","",null,"INC"]
[null,null,null,null,null,"","",null,"INC"]
[null,null,null,null,null,"","",null,"INC"]
[null,null,null,null,null,"","",null,"INC"]
[null,null,null,null,null,"","",null,"INC"]
[null,null,null,null,null,"","",null,"INC"]
[null,null,null,null,null,"","",null,"INC"]
[null,null,null,null,null,"","",null,"INC"]
[null,null,null,null,null,"","",null,"INC"]
[null,null,null,null,null,{"$f":"IF(E78<>\"\",VLOOKUP(E78,$N$4:$O$7,2),\"\")","v":""},{"$f":"IF(E78<>\"\", IF((D78<>\"\")*AND(C78<>\"\"), IF(C78=\"Single\", VLOOKUP(D78, $L$16:$M$31, 2)*F78, VLOOKUP(D78,$O$16:$P$31,2)*F78), \"\"), \"\")","v":""},null,{"$f":"IF((G78<>\"\")*AND(H78<>\"\"), IF(H78<=G78,\"PASS\",\"FAIL\"), \"INC\")","v":"INC"}]
[null,null,null,null,null,"","",null,"INC"]
[null,null,null,null,null,"","",null,"INC"]
[null,null,null,null,null,"","",null,"INC"]
[null,null,null,null,null,"","",null,"INC"]
[null,null,null,null,null,"","",null,"INC"]
[null,null,null,null,null,"","",null,"INC"]
[null,null,null,null,null,"","",null,"INC"]
[null,null,null,null,null,"","",null,"INC"]
[null,null,null,null,null,"","",null,"INC"]
[null,null,null,null,null,"","",null,"INC"]
[null,null,null,null,null,"","",null,"INC"]
[null,null,null,null,null,"","",null,"INC"]
[null,null,null,null,null,"","",null,"INC"]
[null,null,null,null,null,"","",null,"INC"]
[null,null,null,null,null,"","",null,"INC"]
[null,null,null,null,null,"","",null,"INC"]
[null,null,null,null,null,"","",null,"INC"]
[null,null,null,null,null,"","",null,"INC"]
[null,null,null,null,null,"","",null,"INC"]
[null,null,null,null,null,"","",null,"INC"]
[null,null,null,null,null,"","",null,"INC"]
[null,null,null,null,null,"","",null,"INC"]
[null,null,null,null,null,"","",null,"INC"]
[null,null,null,null,null,"","",null,"INC"]
[null,null,null,null,null,"","",null,"INC"]
[null,null,null,null,null,"","",null,"INC"]
[null,null,null,null,null,"","",null,"INC"]
[null,null,null,null,null,"","",null,"INC"]
[null,null,null,null,null,"","",null,"INC"]
[null,null,null,null,null,"","",null,"INC"]
[null,null,null,null,null,"","",null,"INC"]
[null,null,null,null,null,"","",null,"INC"]
[null,null,null,null,null,"","",null,"INC"]
[null,null,null,null,null,"","",null,"INC"]
[null,null,null,null,null,"","",null,"INC"]
[null,null,null,null,null,"","",null,"INC"]
[null,null,null,null,null,"","",null,"INC"]
[null,null,null,null,null,"","",null,"INC"]
[null,null,null,null,null,"","",null,"INC"]
[null,null,null,null,null,"","",null,"INC"]
[null,null,null,null,null,"","",null,"INC"]
[null,null,null,null,null,"","",null,"INC"]
[null,null,null,null,null,"","",null,"INC"]
[null,null,null,null,null,"","",null,"INC"]
[null,null,null,null,null,"","",null,"INC"]
[null,null,null,null,null,"","",null,"INC"]
[null,null,null,null,null,"","",null,"INC"]
[null,null,null,null,null,"","",null,"INC"]
[null,null,null,null,null,"","",null,"INC"]
[null,null,null,null,null,"","",null,"INC"]
[null,null,null,null,null,"","",null,"INC"]
[null,null,null,null,null,"","",null,"INC"]
[null,null,null,null,null,"","",null,"INC"]
[null,null,null,null,null,"","",null,"INC"]
[null,null,null,null,null,"","",null,"INC"]
[null,null,null,null,null,"","",null,"INC"]
[null,null,null,null,null,"","",null,"INC"]
[null,null,null,null,null,"","",null,"INC"]
[null,null,null,null,null,"","",null,"INC"]
[null,null,null,null,null,"","",null,"INC"]
[null,null,null,null,null,"","",null,"INC"]
[null,null,null,null,null,"","",null,"INC"]
[null,null,null,null,null,"","",null,"INC"]
[null,null,null,null,null,{"$f":"IF(E142<>\"\",VLOOKUP(E142,$N$4:$O$7,2),\"\")","v":""},{"$f":"IF(E142<>\"\", IF((D142<>\"\")*AND(C142<>\"\"), IF(C142=\"Single\", VLOOKUP(D142, $L$16:$M$31, 2)*F142, VLOOKUP(D142,$O$16:$P$31,2)*F142), \"\"), \"\")","v":""},null,{"$f":"IF((G142<>\"\")*AND(H142<>\"\"), IF(H142<=G142,\"PASS\",\"FAIL\"), \"INC\")","v":"INC"}]
[null,null,null,null,null,"","",null,"INC"]
[null,null,null,null,null,"","",null,"INC"]
[null,null,null,null,null,"","",null,"INC"]
[null,null,null,null,null,"","",null,"INC"]
[null,null,null,null,null,"","",null,"INC"]
[null,null,null,null,null,"","",null,"INC"]
[null,null,null,null,null,"","",null,"INC"]
[null,null,null,null,null,"","",null,"INC"]
[null,null,null,null,null,"","",null,"INC"]
[null,null,null,null,null,"","",null,"INC"]
[null,null,null,null,null,"","",null,"INC"]
[null,null,null,null,null,"","",null,"INC"]
[null,null,null,null,null,"","",null,"INC"]
[null,null,null,null,null,"","",null,"INC"]
[null,null,null,null,null,"","",null,"INC"]
[null,null,null,null,null,"","",null,"INC"]
[null,null,null,null,null,"","",null,"INC"]
[null,null,null,null,null,"","",null,"INC"]
[null,null,null,null,null,"","",null,"INC"]
[null,null,null,null,null,"","",null,"INC"]
[null,null,null,null,null,"","",null,"INC"]
[null,null,null,null,null,"","",null,"INC"]
[null,null,null,null,null,"","",null,"INC"]
[null,null,null,null,null,"","",null,"INC"]
[null,null,null,null,null,"","",null,"INC"]
[null,null,null,null,null,"","",null,"INC"]
[null,null,null,null,null,"","",null,"INC"]
[null,null,null,null,null,"","",null,"INC"]
[null,null,null,null,null,"","",null,"INC"]
[null,null,null,null,null,"","",null,"INC"]
[null,null,null,null,null,"","",null,"INC"]
[null,null,null,null,null,"","",null,"INC"]
[null,null,null,null,null,"","",null,"INC"]
[null,null,null,null,null,"","",null,"INC"]
[null,null,null,null,null,"","",null,"INC"]
[null,null,null,null,null,"","",null,"INC"]
[null,null,null,null,null,"","",null,"INC"]
[null,null,null,null,null,"","",null,"INC"]
[null,null,null,null,null,"","",null,"INC"]
[null,null,null,null,null,"","",null,"INC"]
[null,null,null,null,null,"","",null,"INC"]
[null,null,null,null,null,"","",null,"INC"]
[null,null,null,null,null,"","",null,"INC"]
[null,null,null,null,null,"","",null,"INC"]
[null,null,null,null,null,"","",null,"INC"]
[null,null,null,null,null,"","",null,"INC"]
[null,null,null,null,null,"","",null,"INC"]
[null,null,null,null,null,"","",null,"INC"]
[null,null,null,null,null,"","",null,"INC"]
[null,null,null,null,null,"","",null,"INC"]
[null,null,null,null,null,"","",null,"INC"]
[null,null,null,null,null,"","",null,"INC"]
[null,null,null,null,null,"","",null,"INC"]
[null,null,null,null,null,"","",null,"INC"]
[null,null,null,null,null,"","",null,"INC"]
[null,null,null,null,null,"","",null,"INC"]
[null,null,null,null,null,"","",null,"INC"]
[null,null,null,null,null,"","",null,"INC"]
[null,null,null,null,null,"","",null,"INC"]
[null,null,null,null,null,"","",null,"INC"]
[null,null,null,null,null,"","",null,"INC"]
[null,null,null,null,null,"","",null,"INC"]
[null,null,null,null,null,"","",null,"INC"]
[null,null,null,null,null,{"$f":"IF(E206<>\"\",VLOOKUP(E206,$N$4:$O$7,2),\"\")","v":""},{"$f":"IF(E206<>\"\", IF((D206<>\"\")*AND(C206<>\"\"), IF(C206=\"Single\", VLOOKUP(D206, $L$16:$M$31, 2)*F206, VLOOKUP(D206,$O$16:$P$31,2)*F206), \"\"), \"\")","v":""},null,{"$f":"IF((G206<>\"\")*AND(H206<>\"\"), IF(H206<=G206,\"PASS\",\"FAIL\"), \"INC\")","v":"INC"}]
[null,null,null,null,null,"","",null,"INC"]
[null,null,null,null,null,"","",null,"INC"]
[null,null,null,null,null,"","",null,"INC"]
[null,null,null,null,null,"","",null,"INC"]
[null,null,null,null,null,"","",null,"INC"]
[null,null,null,null,null,"","",null,"INC"]
[null,null,null,null,null,"","",null,"INC"]
[null,null,null,null,null,"","",null,"INC"]
[null,null,null,null,null,"","",null,"INC"]
[null,null,null,null,null,"","",null,"INC"]
[null,null,null,null,null,"","",null,"INC"]
[null,null,null,null,null,"","",null,"INC"]
[null,null,null,null,null,"","",null,"INC"]
[null,null,null,null,null,"","",null,"INC"]
[null,null,null,null,null,"","",null,"INC"]
[null,null,null,null,null,"","",null,"INC"]
[null,null,null,null,null,"","",null,"INC"]
[null,null,null,null,null,"","",null,"INC"]
[null,null,null,null,null,"","",null,"INC"]
[null,null,null,null,null,"","",null,"INC"]
[null,null,null,null,null,"","",null,"INC"]
[null,null,null,null,null,"","",null,"INC"]
[null,null,null,null,null,"","",null,"INC"]
[null,null,null,null,null,"","",null,"INC"]
[null,null,null,null,null,"","",null,"INC"]
[null,null,null,null,null,"","",null,"INC"]
[null,null,null,null,null,"","",null,"INC"]
[null,null,null,null,null,"","",null,"INC"]
[null,null,null,null,null,"","",null,"INC"]
[null,null,null,null,null,"","",null,"INC"]
[null,null,null,null,null,"","",null,"INC"]
[null,null,null,null,null,"","",null,"INC"]
[null,null,null,null,null,"","",null,"INC"]
[null,null,null,null,null,"","",null,"INC"]
[null,null,null,null,null,"","",null,"INC"]
[null,null,null,null,null,"","",null,"INC"]
[null,null,null,null,null,"","",null,"INC"]
[null,null,null,null,null,"","",null,"INC"]
[null,null,null,null,null,"","",null,"INC"]
[null,null,null,null,null,"","",null,"INC"]
[null,null,null,null,null,"","",null,"INC"]
[null,null,null,null,null,"","",null,"INC"]
[null,null,null,null,null,"","",null,"INC"]
[null,null,null,null,null,"","",null,"INC"]
[null,null,null,null,null,"","",null,"INC"]
[null,null,null,null,null,"","",null,"INC"]
[null,null,null,null,null,"","",null,"INC"]
[null,null,null,null,null,"","",null,"INC"]
[null,null,null,null,null,"","",null,"INC"]
[null,null,null,null,null,"","",null,"INC"]
[null,null,null,null,null,"","",null,"INC"]
[null,null,null,null,null,"","",null,"INC"]
[null,null,null,null,null,"","",null,"INC"]
[null,null,null,null,null,"","",null,"INC"]
[null,null,null,null,null,"","",null,"INC"]
[null,null,null,null,null,"","",null,"INC"]
[null,null,null,null,null,"","",null,"INC"]
[null,null,null,null,null,"","",null,"INC"]
[null,null,null,null,null,"","",null,"INC"]
[null,null,null,null,null,"","",null,"INC"]
[null,null,null,null,null,"","",null,"INC"]
[null,null,null,null,null,"","",null,"INC"]
[null,null,null,null,null,"","",null,"INC"]
[null,null,null,null,null,{"$f":"IF(E270<>\"\",VLOOKUP(E270,$N$4:$O$7,2),\"\")","v":""},{"$f":"IF(E270<>\"\", IF((D270<>\"\")*AND(C270<>\"\"), IF(C270=\"Single\", VLOOKUP(D270, $L$16:$M$31, 2)*F270, VLOOKUP(D270,$O$16:$P$31,2)*F270), \"\"), \"\")","v":""},null,{"$f":"IF((G270<>\"\")*AND(H270<>\"\"), IF(H270<=G270,\"PASS\",\"FAIL\"), \"INC\")","v":"INC"}]
[null,null,null,null,null,"","",null,"INC"]
[null,null,null,null,null,"","",null,"INC"]
[null,null,null,null,null,"","",null,"INC"]
[null,null,null,null,null,"","",null,"INC"]
[null,null,null,null,null,"","",null,"INC"]
[null,null,null,null,null,"","",null,"INC"]
[null,null,null,null,null,"","",null,"INC"]
[null,null,null,null,null,"","",null,"INC"]
[null,null,null,null,null,"","",null,"INC"]
[null,null,null,null,null,"","",null,"INC"]
[null,null,null,null,null,"","",null,"INC"]
[null,null,null,null,null,"","",null,"INC"]
[null,null,null,null,null,"","",null,"INC"]
[null,null,null,null,null,"","",null,"INC"]
[null,null,null,null,null,"","",null,"INC"]
[null,null,null,null,null,"","",null,"INC"]
[null,null,null,null,null,"","",null,"INC"]
[null,null,null,null,null,"","",null,"INC"]
[null,null,null,null,null,"","",null,"INC"]
[null,null,null,null,null,"","",null,"INC"]
[null,null,null,null,null,"","",null,"INC"]
[null,null,null,null,null,"","",null,"INC"]
[null,null,null,null,null,"","",null,"INC"]
[null,null,null,null,null,"","",null,"INC"]
[null,null,null,null,null,"","",null,"INC"]
[null,null,null,null,null,"","",null,"INC"]
[null,null,null,null,null,"","",null,"INC"]
[null,null,null,null,null,"","",null,"INC"]
[null,null,null,null,null,"","",null,"INC"]
[null,null,null,null,null,"","",null,"INC"]
[null,null,null,null,null,"","",null,"INC"]
[null,null,null,null,null,"","",null,"INC"]
[null,null,null,null,null,"","",null,"INC"]
[null,null,null,null,null,"","",null,"INC"]
[null,null,null,null,null,"","",null,"INC"]
[null,null,null,null,null,"","",null,"INC"]
[null,null,null,null,null,"","",null,"INC"]
[null,null,null,null,null,"","",null,"INC"]
[null,null,null,null,null,"","",null,"INC"]
[null,null,null,null,null,"","",null,"INC"]
[null,null,null,null,null,"","",null,"INC"]
[null,null,null,null,null,"","",null,"INC"]
[null,null,null,null,null,"","",null,"INC"]
[null,null,null,null,null,"","",null,"INC"]
[null,null,null,null,null,"","",null,"INC"]
[null,null,null,null,null,"","",null,"INC"]
[null,null,null,null,null,"","",null,"INC"]
[null,null,null,null,null,"","",null,"INC"]
[null,null,null,null,null,"","",null,"INC"]
[null,null,null,null,null,"","",null,"INC"]
[null,null,null,null,null,"","",null,"INC"]
[null,null,null,null,null,"","",null,"INC"]
[null,null,null,null,null,"","",null,"INC"]
[null,null,null,null,null,"","",null,"INC"]
[null,null,null,null,null,"","",null,"INC"]
[null,null,null,null,null,"","",null,"INC"]
[null,null,null,null,null,"","",null,"INC"]
[null,null,null,null,null,"","",null,"INC"]
[null,null,null,null,null,"","",null,"INC"]
[null,null,null,null,null,"","",null,"INC"]
[null,null,null,null,null,"","",null,"INC"]
[null,null,null,null,null,"","",null,"INC"]
[null,null,null,null,null,"","",null,"INC"]
[null,null,null,null,null,{"$f":"IF(E334<>\"\",VLOOKUP(E334,$N$4:$O$7,2),\"\")","v":""},{"$f":"IF(E334<>\"\", IF((D334<>\"\")*AND(C334<>\"\"), IF(C334=\"Single\", VLOOKUP(D334, $L$16:$M$31, 2)*F334, VLOOKUP(D334,$O$16:$P$31,2)*F334), \"\"), \"\")","v":""},null,{"$f":"IF((G334<>\"\")*AND(H334<>\"\"), IF(H334<=G334,\"PASS\",\"FAIL\"), \"INC\")","v":"INC"}]
[null,null,null,null,null,"","",null,"INC"]
[null,null,null,null,null,"","",null,"INC"]
[null,null,null,null,null,"","",null,"INC"]
[null,null,null,null,null,"","",null,"INC"]
[null,null,null,null,null,"","",null,"INC"]
[null,null,null,null,null,"","",null,"INC"]
[null,null,null,null,null,"","",null,"INC"]
[null,null,null,null,null,"","",null,"INC"]
[null,null,null,null,null,"","",null,"INC"]
[null,null,null,null,null,"","",null,"INC"]
[null,null,null,null,null,"","",null,"INC"]
[null,null,null,null,null,"","",null,"INC"]
[null,null,null,null,null,"","",null,"INC"]
[null,null,null,null,null,"","",null,"INC"]
[null,null,null,null,null,"","",null,"INC"]
[null,null,null,null,null,"","",null,"INC"]
[null,null,null,null,null,"","",null,"INC"]
[null,null,null,null,null,"","",null,"INC"]
[null,null,null,null,null,"","",null,"INC"]
[null,null,null,null,null,"","",null,"INC"]
[null,null,null,null,null,"","",null,"INC"]
[null,null,null,null,null,"","",null,"INC"]
[null,null,null,null,null,"","",null,"INC"]
[null,null,null,null,null,"","",null,"INC"]
[null,null,null,null,null,"","",null,"INC"]
[null,null,null,null,null,"","",null,"INC"]
[null,null,null,null,null,"","",null,"INC"]
[null,null,null,null,null,"","",null,"INC"]
[null,null,null,null,null,"","",null,"INC"]
[null,null,null,null,null,"","",null,"INC"]
[null,null,null,null,null,"","",null,"INC"]
[null,null,null,null,null,"","",null,"INC"]
[null,null,null,null,null,"","",null,"INC"]
[null,null,null,null,null,"","",null,"INC"]
[null,null,null,null,null,"","",null,"INC"]
[null,null,null,null,null,"","",null,"INC"]
[null,null,null,null,null,"","",null,"INC"]
[null,null,null,null,null,"","",null,"INC"]
[null,null,null,null,null,"","",null,"INC"]
[null,null,null,null,null,"","",null,"INC"]
[null,null,null,null,null,"","",null,"INC"]
[null,null,null,null,null,"","",null,"INC"]
[null,null,null,null,null,"","",null,"INC"]
[null,null,null,null,null,"","",null,"INC"]
[null,null,null,null,null,"","",null,"INC"]
[null,null,null,null,null,"","",null,"INC"]
[null,null,null,null,null,"","",null,"INC"]
[null,null,null,null,null,"","",null,"INC"]
[null,null,null,null,null,"","",null,"INC"]
[null,null,null,null,null,"","",null,"INC"]
[null,null,null,null,null,"","",null,"INC"]
[null,null,null,null,null,"","",null,"INC"]
[null,null,null,null,null,"","",null,"INC"]
[null,null,null,null,null,"","",null,"INC"]
[null,null,null,null,null,"","",null,"INC"]
[null,null,null,null,null,"","",null,"INC"]
[null,null,null,null,null,"","",null,"INC"]
[null,null,null,null,null,"","",null,"INC"]
[null,null,null,null,null,"","",null,"INC"]
[null,null,null,null,null,"","",null,"INC"]
[null,null,null,null,null,"","",null,"INC"]
[null,null,null,null,null,"","",null,"INC"]
[null,null,null,null,null,"","",null,"INC"]
[null,null,null,null,null,{"$f":"IF(E398<>\"\",VLOOKUP(E398,$N$4:$O$7,2),\"\")","v":""},{"$f":"IF(E398<>\"\", IF((D398<>\"\")*AND(C398<>\"\"), IF(C398=\"Single\", VLOOKUP(D398, $L$16:$M$31, 2)*F398, VLOOKUP(D398,$O$16:$P$31,2)*F398), \"\"), \"\")","v":""},null,{"$f":"IF((G398<>\"\")*AND(H398<>\"\"), IF(H398<=G398,\"PASS\",\"FAIL\"), \"INC\")","v":"INC"}]
[null,null,null,null,null,"","",null,"INC"]
[null,null,null,null,null,"","",null,"INC"]
[null,null,null,null,null,"","",null,"INC"]
[null,null,null,null,null,"","",null,"INC"]
[null,null,null,null,null,"","",null,"INC"]
[null,null,null,null,null,"","",null,"INC"]
[null,null,null,null,null,"","",null,"INC"]
[null,null,null,null,null,"","",null,"INC"]
[null,null,null,null,null,"","",null,"INC"]
[null,null,null,null,null,"","",null,"INC"]
[null,null,null,null,null,"","",null,"INC"]
[null,null,null,null,null,"","",null,"INC"]
[null,null,null,null,null,"","",null,"INC"]
[null,null,null,null,null,"","",null,"INC"]
[null,null,null,null,null,"","",null,"INC"]
[null,null,null,null,null,"","",null,"INC"]
[null,null,null,null,null,"","",null,"INC"]
[null,null,null,null,null,"","",null,"INC"]
[null,null,null,null,null,"","",null,"INC"]
[null,null,null,null,null,"","",null,"INC"]
[null,null,null,null,null,"","",null,"INC"]
[null,null,null,null,null,"","",null,"INC"]
[null,null,null,null,null,"","",null,"INC"]
[null,null,null,null,null,"","",null,"INC"]
[null,null,null,null,null,"","",null,"INC"]
[null,null,null,null,null,"","",null,"INC"]
[null,null,null,null,null,"","",null,"INC"]
[null,null,null,null,null,"","",null,"INC"]
[null,null,null,null,null,"","",null,"INC"]
[null,null,null,null,null,"","",null,"INC"]
[null,null,null,null,null,"","",null,"INC"]
[null,null,null,null,null,"","",null,"INC"]
[null,null,null,null,null,"","",null,"INC"]
[null,null,null,null,null,"","",null,"INC"]
[null,null,null,null,null,"","",null,"INC"]
[null,null,null,null,null,"","",null,"INC"]
[null,null,null,null,null,"","",null,"INC"]
[null,null,null,null,null,"","",null,"INC"]
[null,null,null,null,null,"","",null,"INC"]
[null,null,null,null,null,"","",null,"INC"]
[null,null,null,null,null,"","",null,"INC"]
[null,null,null,null,null,"","",null,"INC"]
[null,null,null,null,null,"","",null,"INC"]
[null,null,null,null,null,"","",null,"INC"]
[null,null,null,null,null,"","",null,"INC"]
[null,null,null,null,null,"","",null,"INC"]
[null,null,null,null,null,"","",null,"INC"]
[null,null,null,null,null,"","",null,"INC"]
[null,null,null,null,null,"","",null,"INC"]
[null,null,null,null,null,"","",null,"INC"]
[null,null,null,null,null,"","",null,"INC"]
[null,null,null,null,null,"","",null,"INC"]
[null,null,null,null,null,"","",null,"INC"]
[null,null,null,null,null,"","",null,"INC"]
[null,null,null,null,null,"","",null,"INC"]
[null,null,null,null,null,"","",null,"INC"]
[null,null,null,null,null,"","",null,"INC"]
[null,null,null,null,null,"","",null,"INC"]
[null,null,null,null,null,"","",null,"INC"]
[null,null,null,null,null,"","",null,"INC"]
[null,null,null,null,null,"","",null,"INC"]
[null,null,null,null,null,"","",null,"INC"]
[null,null,null,null,null,"","",null,"INC"]
[null,null,null,null,null,{"$f":"IF(E462<>\"\",VLOOKUP(E462,$N$4:$O$7,2),\"\")","v":""},{"$f":"IF(E462<>\"\", IF((D462<>\"\")*AND(C462<>\"\"), IF(C462=\"Single\", VLOOKUP(D462, $L$16:$M$31, 2)*F462, VLOOKUP(D462,$O$16:$P$31,2)*F462), \"\"), \"\")","v":""},null,{"$f":"IF((G462<>\"\")*AND(H462<>\"\"), IF(H462<=G462,\"PASS\",\"FAIL\"), \"INC\")","v":"INC"}]
[null,null,null,null,null,"","",null,"INC"]
[null,null,null,null,null,"","",null,"INC"]
[null,null,null,null,null,"","",null,"INC"]
[null,null,null,null,null,"","",null,"INC"]
[null,null,null,null,null,"","",null,"INC"]
[null,null,null,null,null,"","",null,"INC"]
[null,null,null,null,null,"","",null,"INC"]
[null,null,null,null,null,"","",null,"INC"]
[null,null,null,null,null,"","",null,"INC"]
[null,null,null,null,null,"","",null,"INC"]
[null,null,null,null,null,"","",null,"INC"]
[null,null,null,null,null,"","",null,"INC"]
[null,null,null,null,null,"","",null,"INC"]
[null,null,null,null,null,"","",null,"INC"]
[null,null,null,null,null,"","",null,"INC"]
[null,null,null,null,null,"","",null,"INC"]
[null,null,null,null,null,"","",null,"INC"]
[null,null,null,null,null,"","",null,"INC"]
[null,null,null,null,null,"","",null,"INC"]
[null,null,null,null,null,"","",null,"INC"]
[null,null,null,null,null,"","",null,"INC"]
[null,null,null,null,null,"","",null,"INC"]
[null,null,null,null,null,"","",null,"INC"]
[null,null,null,null,null,"","",null,"INC"]
[null,null,null,null,null,"","",null,"INC"]
[null,null,null,null,null,"","",null,"INC"]
[null,null,null,null,null,"","",null,"INC"]
[null,null,null,null,null,"","",null,"INC"]
[null,null,null,null,null,"","",null,"INC"]
[null,null,null,null,null,"","",null,"INC"]
[null,null,null,null,null,"","",null,"INC"]
[null,null,null,null,null,"","",null,"INC"]
[null,null,null,null,null,"","",null,"INC"]
[null,null,null,null,null,"","",null,"INC"]
[null,null,null,null,null,"","",null,"INC"]
[null,null,null,null,null,"","",null,"INC"]
[null,null,null,null,null,"","",null,"INC"]
[null,null,null,null,null,"","",null,"INC"]
[null,null,null,null,null,"","",null,"INC"]
[null,null,null,null,null,"","",null,"INC"]
[null,null,null,null,null,"","",null,"INC"]
[null,null,null,null,null,"","",null,"INC"]
[null,null,null,null,null,"","",null,"INC"]
[null,null,null,null,null,"","",null,"INC"]
[null,null,null,null,null,"","",null,"INC"]
[null,null,null,null,null,"","",null,"INC"]
[null,null,null,null,null,"","",null,"INC"]
[null,null,null,null,null,"","",null,"INC"]
["jjkkgg"]

{"sheet":"Hybrid Microcircuit","index":28,"n_rows":9,"n_cols":21,"rows_kept":9,"cut":false,"hidden":false,"merged":[[5,0,5,1],[5,7,5,10],[5,11,5,17]]}
[null,null,null,null,null,null,null,null,null,"CUI//SP-EXPT"]
[null,null,null,null,null,null,null,null,null,null,null,null,"Conservative numbers based on Thermal Analysis"]
[null,null,null,null,null,null,null,null,null,null,null,null,"Analysis results Junction Temperatures are used as Case Temperatures"]
[]
[]
["PART IDENTIFICATION",null,null,"INPUT VOLTAGE",null,null,null,"CURRENT",null,null,null,"TEMPERATURE",null,null,null,null,null,null,null,"NOTES","ACCEPT"]
["REFDES","PART NUMBER","DESCRIPTION","RATED              VINa","PEAK                VINa","STRESS RATIO","DERATING FACTOR","RATED              IOUT","APPLIED          IOUT","STRESS RATIO","DERATING FACTOR","RATED JUNCTION TEMP","JUNCTION TEMP","STRESS RATIO","DERATING FACTOR","DERATED CASE TEMP","CASE TEMP","STRESS RATIO","DERATING FACTOR",null,"YES/NO"]
[null,null,null,"(V)","(V)",null,null,"(A)","(A)",null,null,"oC","oC",null,null,"oC","oC"]
[null,null,null,null,null,null,null,null,null,null,null,null,null,{"$f":"M9/L9","v":{"$error":"#DIV/0!"}}]

{"sheet":"Revision notes","index":29,"n_rows":139,"n_cols":1,"rows_kept":139,"cut":false,"hidden":false,"merged":[]}
["Revision 2.4"]
["Changes to the Resistor Worksheet correct errors in setting the maximum allowable voltage across low power, low ohm resistors and eliminates a redundant column."]
["The previous version contained an error that resulted in over derating low power, low ohm resistors."]
["The alternate voltage derating column has been retitled GSFC Derated Voltage.  It calculates the allowable derated voltage based on (1) the product of the standard voltage rating and the derating factor or, (2) the voltage derating calculation for low power, low resistance value resistors using the derated power based on part operating temperature and specifications characteristics."]
["An additional flag has been added to the part operating temperature to red flag parts operating at or above T3 (Part damage temperature)"]
["Revised 11/28/2006  by J. Galleher/SRSTE/302"]
[]
["Revision 2.5 Per Code 302 request - password revised to prevent inadvertent modification of Spreadsheet equations"]
["Revised 11/29/06 by J. Galleher/SRSTE/302"]
[]
["Revision 3.0 updated per Code 302 request - unlocked columns H&J in the Hermetic Microcircuit worksheet and made minor textual corrections"]
["Revised 1/3/2007 by J. Galleher/SRSTE/302"]
["Revision 3.0a corrected typo in Capacitor spreadsheet notes and added instruction  in Overview on pasting data into spread sheet"]
["Revised 2/7/2007 by J. Galleher/SRSTE/302"]
["Revision 3.5  corrected fuse temperature derating and added a column for the 50 volt circuit voltage limit to avoid arcing within the fuse per fuse derating note 6.  Established a 125 Deg. C upper ambient temperature limit per Thom. Perry."]
["revised 3/20/07 by J. Galleher/SRSTE/302"]
["corrected drop down menu access on crystal oscillators column H- 4/6/07"]
["rev3.6"]
["revised 10/23/07 by J Galleher SRS Mantech/322"]
["Added red tell tales to additional cell formatting on the resistor sheet to assist users in identifying out of tolerance conditions ."]
["Rev 3.7"]
["Revised 10/30/07 by J. Galleher SRS Mantech"]
["Connector Worksheet Corrected Pass Fail equation corruption below the first row."]
["Resistor Worksheet- Added a duty cycle factor for calculating derated voltage. "]
["Rev 4.0 11/14/07 By J. Galleher Added unlocked remarks columns for users convenience"]
["upgraded security of locked computational columns. Project data sheet is also unlocked for project use"]
["Rev.4.2 4/3/08 By J.Galleher Mantech SRS/322 Added Worksheet for Solid Body Fuses"]
["Rev 4.2a 4/5/08 by j.Galleher Retired person- corrected flaws in solid body worksheet."]
[]
[]
["(Fixed from users pre-CCR version)"]
[]
["Revised 11/30/2017 by Isaac Yang"]
["Capacitor section change/correction notes:"]
["1. Reorder Notes and Capacitor type explaination sentences such as \"C = Ceramic - (Types CCR, CKS, CKR, CDR); WS = … etc.\""]
["2. Change note 2 and change “If theapplied voltage is less than 10 volts on CCR, CDR, & CKR types special testing is required for parts with less than 100 VDC rating.” as see note 2 above due to a difficult reading."]
["3. Move notes from memo 562-PM-2012-02, line 6 – 16 on page 2 from bottom to top of the table."]
["4. Change the end of sentence in original cell M23 (new cell M31) from (see Cell B5) to (see cell B7)."]
["5. Delet red words “(Grade 1is mechanized,)” in new cell B8 (old cell B7). "]
["6. Add a new function for checking Tantalum Solid serial connecting resistance for Grade 1 and Grade 2 by doing the following modifications:"]
["6.1. Add an application selecting column (Column N) with the title \" Solid Tantalum \"SD\" (CSR, CSS and CWR) Effective Series Resistance for Grade 1 or Grade 2 applications (See Cell B7 & B8)\";"]
["6.2. Make all of cells with draw down options: Gd 1 or Gd 2; those mean option either Grade 1 applications or Grade 2 applications;"]
["6.3. Change formula \"=IF((J20<>\"\")*AND(J20<=I20)**AND(L20<=K20)*AND(R20+S20+T20>=1), \"PASS\", \"FAIL\")\" in cell O20 to \"=IF((J20<>\"\")*AND(J20<=I20)**AND(L20<=K20)*AND(R20+S20+T20>1), \"PASS\", \"FAIL\")\" "]
["6.4. Draw the cell O20 down to the bottom cell to change each cell in new O column tha same function as it. (This correctoin is for the issue showing \"PASS\" in case of SD type, the series resistance more than one ohm, but less than 0.3X Operating voltage)"]
["6.5. Change the formula in S20 to \"=IF((G20=\"SD\"*AND(N20=\"Gd 1\")*AND(M20/J20>=0.3), 1, IF((G20=\"SD\")*AND(N20=\"Gd 2)*AND(M20/J20>=0.1), 1, IF((G20<>\"SD\"), 1, 0)))"]
["6.6. Draw the cell S20 all the way down to the bottom cell to change each cell in new S column tha same function as it. (This correctoin is adding Gd 1 and Gd 2 options for checking the series resistance of SD type caps in Grade 1 or Grade 2 applications."]
["7. Freeez the title rows to Row 15."]
["8. Hide Column Q, R, S and T"]
[]
["Resistor section change/correction notes:"]
["1. Reorder Notes on the top of table;"]
["2. Changed the end of sentence \"(P*R)^.5\" to \" \\/(P*R)\""]
["3. Changed Font of all words from 8 to 10"]
["4. Formula in old cell O38 or new cell O19 seems modified by adding a function when ambient temp is more than T2, GSFC Derated Operation Power is zero. However, other cells in O column below didn't change as O38/O19, they were still show a negtive value when ambient temp is more than T2. Drag O19 all the way down to the end of O column to change formulas in each cell the same as it. "]
["5. Changed Formula in Column J, get ride of the last \"/P15\". Because Duty Cycle can't increase the voltage derating value."]
["6. Changed formula in column J, each item SQRT(O15*E15/P15) into (SQRT(O15*E15))/P15."]
[]
["General Purpose Diode change/correction notes:"]
["1. Title including: General Purpose, Switching, Pin/Schottky, and Thyristors"]
["2. Change column S that won't display the nosense number \"-40\"."]
["3. Add *AND(T10<>\"\") into the formula in cells in column U."]
[]
["Varactor Diode change notes"]
["Each single derating factor has three different selected values? Corrected"]
[]
["Microcircuit Change notes:"]
["1. Reorder the head of table and freeze the title."]
["2. Change the word \"maximum\" in new cell C6 from \"1.1) For low voltage (<5V) devices, use manufacturer's maximum operating conditions.\" to \"recommended\""]
["3. Add Part Type selection column right after Schematic column to select as \"Digital\" or \"Linear\" type. (It can avoid a selection error in derating parameters)"]
["4. Change derating factors in new G, I and K columns as functional formulas to give deraing factors automatically when part type is selected."]
["5. Add a reminding note \"Select Part Type first\" on the top of the table."]
["6. Change the formula in new column S/old column R from \"J17*K17\" to \"MIN(J17*K17, (J17-40), 110) so as to meet Note 2/ on the top of table."]
[]
["Plastic Encapsulated Microcircuit change notes:"]
["1. Two PEM tables are combined as one table."]
["2. Add column K for selecting power device (Note 2)."]
["3. Formula in column X has a section Q12<=P12, but one is power, the other is voltage, they are not comparable!!!"]
[]
["Connector change notes:"]
["It seems wasn't finished, miss voltage derating function of operation voltage and notes."]
["1. add two notes to show what's the way the worhseet checking."]
[]
["Magnetics change notes:"]
["The table shows derating is -20 deg C, workbook shows 75%, which one is right?"]
["NOTE: This needs to be fixed still (2/2018)"]
[]
["Crystal Oscillator Change Notes:"]
["1. Add a digital/linear part selecting column D. "]
["2. Change derating factors in new G, I and K columns as functional formulas to give deraing factors automatically when part type is selected."]
["3. Freeze the title row of table. "]
["4. Change M column formula as MIN(110, (H12-40), (H12*I12))"]
[]
["Solid Body Fuses change notes"]
["Add Column K to show GSFC derating short circuit voltage."]
[]
["Hollow Body Fuses change notes"]
["1. Correct a data error in new cell R16 from 0.4 to 0.3, it should be 0.25 versus 0.3."]
["2. Correct formular error in column G to \"=IF(E20>1.75, 0.5, IF(E20>0.875, 0.45, IF(E20>0.44, 0.4, IF(E20>0.313, 0.35, IF(E20>0.19, 0.3, IF(E20>0.0625, 0.25, \"\"))))))\""]
[]
["Thermistor Change Notes"]
["The table was only for PTC thermistor, not for NTC thermistor. Adding Columns E, G and H for NTC type thermistor derating. "]
[]
["Relay change note:"]
["1. Change note 2 and note 3 to make them the same as the derating page of EEE-INST_002."]
["2. Add two columns I and J for typing in transient current surge information. "]
["3. Modified column O to perform the two formulas and conditions of note 3.  "]
[]
["Switch Change Notes:"]
["Add Switch type, load type and Ambient temperature columns E, F and G to decide the derating factor without looking the derating section of EEE-INST-002."]
[]
["Wire and Cable change notes:"]
["Single wire and Bundled wire & cable sections are combined into one section as Wire & Cable with adding wire type selection column E."]
[]
[]
["Revised 12/18/2018 by Paula Pruessner"]
["Removed all Reference Designator and Assembly Drawing columns, as this information is now included in the \"Project Data\" sheet."]
["Changed units in Thermistor sheet to W"]
["Modified Magnetics Sheet to show stress parameter and derating based on Insulation Class"]
["Updated Hermetic Microcircuits sheet so that clock isn't included in derating for linear devices. "]
[]
["Revised 11/15/19"]
["Revised pass/fail formulas VVSBF Diodes to address issues with what parameters show up for derating criteria after part type selection."]
[]
["Revised 1/14/20 "]
["Cleaned up the spreadsheet to match upcoming Solid Body Fuse section wording from Parts Branch for comments. "]
["Modified the connector spreadsheet to allow for DWV test voltage and operating voltage to be used"]
["Updated Hermetic Microcircuits sheet to show pass/fail criteria by parameter more clearly"]
["Thermistor spreadsheet - added blackout for cells that aren't used for calculations based on part type selection"]
[]
["Revised 2/19/21"]
["Removed red \"Fails Derating Requirement\" cells, which are no longer referred to. "]
[]
["Revised 9/28/2021"]
["Corrected some incorrect cell mapping on the VVZBF tab that was causing issues with FET current regulator diodes and BVS pass/fail indications"]
["Added additional columns (Z-AF) in the Microcircuit-Hermetic sheet to make the pass/fail criteria clearer.  "]
[]
["Revised 2/28/23"]
["Includes Project Information to match documents for Project CM systems"]
["Added columns (Z – AF) in the Microcircuit-Hermetic sheet to make the pass/fail criteria clearer"]

{"sheet":"Sheet1","index":30,"n_rows":0,"n_cols":0,"rows_kept":0,"cut":false,"hidden":false,"merged":[]}